{"text_format":"1","workbook":"xlsx","n_sheets":11,"sheets":["Menú Inscripciones","Inscripciones","INFORMACION INSCRIPCIONES","Validaciones","PRESENCIAL NACIONAL - VIRTUALES","Cursos Presenciales","Cursos Virtuales","Video Reclasificación","Virtual Cruz Roja","Virtual en línea (Go to webinar","SENA ALTURA"],"not_rendered":{"charts":0,"images":5,"macros":1,"external_links":1,"defined_names":53,"comments":0,"pivot_tables":1},"unopened":[],"bounds":{"document_bytes":16777216,"sheet_cells":100000,"rows_first":2000,"rows_last":500,"rows_between":2000,"halvings":0,"cell_chars":16384,"cell_head_chars":4096},"cells_cut":0,"cells_raw":0,"read":"whole","date_system":"1900"}

{"sheet":"Menú Inscripciones","index":0,"n_rows":0,"n_cols":0,"rows_kept":0,"cut":false,"hidden":false,"merged":[]}

{"sheet":"Inscripciones","index":1,"n_rows":306,"n_cols":12,"rows_kept":306,"cut":false,"hidden":false,"merged":[]}
[]
[]
[]
[]
[]
[]
[]
[]
[]
["PROGRAMA","TEMA","PERFIL ASISTENTES","MODALIDAD","CIUDAD","FECHA","HORARIO","LUGAR","MAXIMO ASISTENTES POR EMPRESA","REALIZAR INSCRIPCION","MODALIDAD"]
{"$rows_left_out":297}
{"sheet":"INFORMACION INSCRIPCIONES","index":2,"n_rows":8,"n_cols":14,"rows_kept":8,"cut":false,"hidden":true,"merged":[[8,1,8,17],[0,1,0,17],[1,1,1,17],[2,1,2,17],[3,1,3,17],[4,1,4,9],[4,10,4,12],[4,13,4,17],[5,1,5,9],[5,10,5,12],[5,13,5,17],[6,1,6,17],[7,1,7,17]]}
[null,"POLITICAS DE INSCRIPCION PNE 2018"]
[null,"Para poder realizar su inscripción, la empresa afiliada debe tener en cuenta las siguientes políticas, las cuales serán de estricto cumplimiento\n\n1. La empresa debe estar afiliada en la ARL LIBERTY \n2. EL participante debe estar laborando como empleado directo en la empresa afiliada a la ARL LIBERTY \n3. Conocer la programación de interés en su ciudad antes de enviar su inscripción \n4. Seleccionar al funcionario que sea parte del equipo líder del SGSST o integrante del COPASST, Comité de convivencia o Brigada de emergencias o Recursos Humanos  para que sea multiplicador de la información al interior de la empresa.\n5. Para los entrenamientos en la Metodología presencial solo se permitirá la inscripción de dos (2) participantes por empresa, esto con el fin de brindar mayor cobertura a todas nuestras empresas afiliadas.  Los cupos en esta modalidad son limitados y estan sujetos a disponibilidad.                                              \n6. Realizar y enviar su pre-inscripción únicamente en el formato de inscripción establecido, al correo electrónico indicado. \n7. Enviar la inscripción a más tardar 8 días antes del curso, abstenerse de enviar programaciones de meses siguientes.                                                                                                                                                                                                                                                                                                     \n8. Para asistir a las capacitaciones, la empresa recibirá un correo electrónico de confirmación del cupo, el cual contiene la información necesaria para que el participante pueda asistir.                                                                                                                                                                               9. En caso de realizar el cambio de un participante confirmado, la empresa deberá informar el nombre del nuevo participante máximo con 3 días hábiles de anticipación a la capacitación.                                                                                                                                                                  10. Las confirmaciones se remiten 1 día antes del inicio del curso presencial                                                                                                                                                                                                                                                                                                                                                                                                                                                      11. La confirmación de los cursos virtuales se realizan 2 días antes, recibirá un correo de soporte aulas con las indicaciones para la conexión.                                                                                                                                                                                                                                                                                                                       12. Los cursos virtuales, excepto, el de Cruz Roja Colombiana, estarán abiertos todo el tiempo a partir de la fecha que allí se indica y podrán inscribirse en cualquier momento. "]
[null,"PROCESO DE INSCRIPCION AL PNE 2018"]
[null,"Después de definir a qué programa desea asistir, debe guardar el archivo en su equipo y  enviar el formato de inscripción totalmente diligenciado al correo"]
[null,"CORREO",null,null,null,null,null,null,null,null,"TELEFONO",null,null,"NOMBRE"]
[null,"inscripcionesPNE@Libertycolombia.com",null,null,null,null,null,null,null,null,"TEL: (1)3103300 EXT 1159",null,null,"Angélica Mora Hernández"]
[null," FORMATO UNICO PARA FORMALIZACIÓN DE INSCRIPCIÓN PNE 2018 "]
[null,"CONFIRMACIÓN DE CUPOS"]

{"sheet":"Validaciones","index":3,"n_rows":292,"n_cols":10,"rows_kept":292,"cut":false,"hidden":true,"merged":[]}
[]
[]
["Cuenta de TEMA"]
["PROGRAMA","TEMA","PERFIL DE LOS ASISTENTES","MODALIDAD ","CIUDAD","FECHA","HORARIO","LUGAR","PROMEDIO ASISTENTES POR EMPRESA","Total"]
["ATENCION DE LA ENFERMEDAD LABORAL","Proceso de definición de enfermedad laboral y calificación, acciones para prevenir los daños en caso de IPP e invalidez, para lograr la rehabilitación integral, procesos de readaptación y reubicación laboral","Los participantes deben estar afiliados a la ARL LIBERTY  y  tener a cargo el Sistema de Gestión de Seguridad y Salud en el Trabajo o pertenecer al área de Recursos Humanos o área médica de la empresa.","VIRTUAL ","NACIONAL","2019-03-01","9:00 a 11:00 a.m. ","Liberty University",200,1]
["ATENCION DEL ACCIDENTE LABORAL ","Acceso al servicio Asistencial y Reconocimiento de las prestaciones económicas de las contingencias de los accidentes laborales AL y enfermedad laboral EL.\n","Los participantes deben estar afiliados a la ARL LIBERTY  y  tener a cargo el Sistema de Gestión de Seguridad y Salud en el Trabajo o pertenecer al área de Recursos Humanos o área médica de la empresa.","VIRTUAL ","NACIONAL","2019-03-01","9:00 - 11:00 a.m.","Liberty University",200,1]
["COMITÉ DE CONVIVENCIA","COMITÉ DE CONVIVENCIA LABORAL (Aula viviendo en armonía).","Personal responsable del sistema de gestión, Talento humano y comité de convivencia. ","VIRTUAL ","NACIONAL","2019-10-31","Abierto","Liberty University",200,1]
["COPASST","Gestión Efectiva del Copasst. Módulo 1. Funciones y responsabilidades frente a dec. 1072 ,Reuniones efectivas, plan de trabajo,  Inspecciones de seguridad  y  auditoria.  ","Dirigidos a los copasst y vigias de seguridad y salud en el trabajo. ","PRESENCIAL ","BARRANQUILLA","2019-05-23","8:00 a.m. - 12:00 m","ICONTEC Cra 57 No. 70-89 Barranquilla",3,1]
["COPASST","Gestión Efectiva del Copasst. Módulo 1. Funciones y responsabilidades frente a dec. 1072 ,Reuniones efectivas, plan de trabajo,  Inspecciones de seguridad  y  auditoria.  ","Dirigidos a los copasst y vigias de seguridad y salud en el trabajo. ","PRESENCIAL ","BUCARAMANGA","2019-03-21","8:00 a.m. - 12:00 m","CAJASAN Cra 27 No 61-78",2,1]
["COPASST","Gestión Efectiva del Copasst. Módulo 1. Funciones y responsabilidades frente a dec. 1072 ,Reuniones efectivas, plan de trabajo,  Inspecciones de seguridad  y  auditoria.  ","Dirigidos a los copasst y vigias de seguridad y salud en el trabajo. ","PRESENCIAL ","CALI","2019-03-07","8:00 a.m. - 12:00 m","Av. 5 Norte # 38N-81",2,1]
{"$rows_left_out":283}
{"sheet":"PRESENCIAL NACIONAL - VIRTUALES","index":4,"n_rows":431,"n_cols":18,"rows_kept":431,"cut":false,"hidden":true,"merged":[]}
[null,"PROGRAMA","TEMA","PERFIL DE LOS ASISTENTES","MODALIDAD ","CIUDAD","HORARIO","FECHA","LUGAR","ÁREA RESPONSABLE","Mes","MÁXIMO DE ASISTENTES ","PROMEDIO ASISTENTES POR EMPRESA","ASESOR",null,"HORAS","ver","ver"]
[null,"TRABAJO EN ALTURA ","Entrenamiento para trabajos en alturas (Avanzado) - Nivel Avanzado: 40 horas; de las cuales mínimo 16 serán teóricas y 24 de entrenamiento práctico","Personal con exposición a peligro por condición de seguridad, trabajo en alturas","PRESENCIAL ","BOGOTÁ","8:00 am - 5:00 pm\n40 HORAS\n","2019-01-01","Sede Complejo Cazuca – Autopista sur Carrera 4ª N° 53 – 54","PYP",{"$f":"UPPER(TEXT(H2,\"mmmm\"))","v":"ENERO"},25,null,"SENA",null,40]
[null,"TRABAJO EN ALTURA ","Entrenamiento para trabajos en alturas (Avanzado) - Nivel Avanzado: 40 horas; de las cuales mínimo 16 serán teóricas y 24 de entrenamiento práctico","Personal con exposición a peligro por condición de seguridad, trabajo en alturas","PRESENCIAL ","BOGOTÁ","8:00 am - 5:00 pm\n40 HORAS\n","2019-02-01","Sede Complejo Cazuca – Autopista sur Carrera 4ª N° 53 – 54","PYP","FEBRERO",25,null,"SENA",null,40]
[null,"TRABAJO EN ALTURA ","Entrenamiento para trabajos en alturas (Avanzado) - Nivel Avanzado: 40 horas; de las cuales mínimo 16 serán teóricas y 24 de entrenamiento práctico","Personal con exposición a peligro por condición de seguridad, trabajo en alturas","PRESENCIAL ","BOGOTÁ","8:00 am - 5:00 pm\n40 HORAS\n","2019-03-01","Sede Complejo Cazuca – Autopista sur Carrera 4ª N° 53 – 54","PYP","MARZO",25,null,"SENA",null,40]
[null,"TRABAJO EN ALTURA ","Entrenamiento para trabajos en alturas (Avanzado) - Nivel Avanzado: 40 horas; de las cuales mínimo 16 serán teóricas y 24 de entrenamiento práctico","Personal con exposición a peligro por condición de seguridad, trabajo en alturas","PRESENCIAL ","BOGOTÁ","8:00 am - 5:00 pm\n40 HORAS\n","2019-04-01","Sede Complejo Cazuca – Autopista sur Carrera 4ª N° 53 – 54","PYP","ABRIL",25,null,"SENA",null,40]
[null,"TRABAJO EN ALTURA ","Entrenamiento para trabajos en alturas (Avanzado) - Nivel Avanzado: 40 horas; de las cuales mínimo 16 serán teóricas y 24 de entrenamiento práctico","Personal con exposición a peligro por condición de seguridad, trabajo en alturas","PRESENCIAL ","BOGOTÁ","8:00 am - 5:00 pm\n40 HORAS\n","2019-05-01","Sede Complejo Cazuca – Autopista sur Carrera 4ª N° 53 – 54","PYP","MAYO",25,null,"SENA",null,40]
[null,"TRABAJO EN ALTURA ","Entrenamiento para trabajos en alturas (Avanzado) - Nivel Avanzado: 40 horas; de las cuales mínimo 16 serán teóricas y 24 de entrenamiento práctico","Personal con exposición a peligro por condición de seguridad, trabajo en alturas","PRESENCIAL ","BOGOTÁ","8:00 am - 5:00 pm\n40 HORAS\n","2019-06-01","Sede Complejo Cazuca – Autopista sur Carrera 4ª N° 53 – 54","PYP","JUNIO",25,null,"SENA",null,40]
[null,"TRABAJO EN ALTURA ","Entrenamiento para trabajos en alturas (Avanzado) - Nivel Avanzado: 40 horas; de las cuales mínimo 16 serán teóricas y 24 de entrenamiento práctico","Personal con exposición a peligro por condición de seguridad, trabajo en alturas","PRESENCIAL ","BOGOTÁ","8:00 am - 5:00 pm\n40 HORAS\n","2019-07-01","Sede Complejo Cazuca – Autopista sur Carrera 4ª N° 53 – 54","PYP","JULIO",25,null,"SENA",null,40]
[null,"TRABAJO EN ALTURA ","Entrenamiento para trabajos en alturas (Avanzado) - Nivel Avanzado: 40 horas; de las cuales mínimo 16 serán teóricas y 24 de entrenamiento práctico","Personal con exposición a peligro por condición de seguridad, trabajo en alturas","PRESENCIAL ","BOGOTÁ","8:00 am - 5:00 pm\n40 HORAS\n","2019-08-01","Sede Complejo Cazuca – Autopista sur Carrera 4ª N° 53 – 54","PYP","AGOSTO",25,null,"SENA",null,40]
[null,"TRABAJO EN ALTURA ","Entrenamiento para trabajos en alturas (Avanzado) - Nivel Avanzado: 40 horas; de las cuales mínimo 16 serán teóricas y 24 de entrenamiento práctico","Personal con exposición a peligro por condición de seguridad, trabajo en alturas","PRESENCIAL ","BOGOTÁ","8:00 am - 5:00 pm\n40 HORAS\n","2018-09-01","Sede Complejo Cazuca – Autopista sur Carrera 4ª N° 53 – 54","PYP","SEPTIEMBRE",25,null,"SENA",null,40]
{"$rows_left_out":422}
{"sheet":"Cursos Presenciales","index":5,"n_rows":3,"n_cols":15,"rows_kept":3,"cut":false,"hidden":true,"merged":[]}
["CIUDAD","MODALIDAD","TEMA","NIT \nsin número de verificación","EMPRESA","CEDULA","NOMBRES COMPLETOS DEL PARTICIPANTE","CORREO ELECTRONICO","CORREO DEL RESPONSABLE DEL SISTEMA DE GESTION DE SEGURIDAD Y SALUD EN EL TRABAJO  DE LA EMPRESA","NOMBRE DEL GESTOR O COORDINADOR DE PREVENCION","HORARIO","FECHA","LUGAR",{"$f":"IFERROR(+VLOOKUP(C2,'PRESENCIAL NACIONAL - VIRTUALES'!C:M,10,0),0)","v":0},{"$f":"+COUNTA(F2:F150)","v":0}]
[null,null,null,null,null,null,null,null,null,null,"8:00 a.m. - 12:00 m","2019-05-09","ICONTEC Cra 57 No. 70-89 Barranquilla"]
[null,null,null,null,null,null,null,null,null,null,"8:00 a.m. - 12:00 m","2019-05-09","ICONTEC Cra 57 No. 70-89 Barranquilla"]

{"sheet":"Cursos Virtuales","index":6,"n_rows":2,"n_cols":16,"rows_kept":2,"cut":false,"hidden":true,"merged":[]}
["CÉDULA","APELLIDOS","NOMBRES","FECHA DE NACIMIENTO\n(SOLO CURSO 50 H0RAS  SG-SST)","CORREO","CIUDAD","TELEFONO 1","TELEFONO 2","EMPRESA","NIT \nsin número de verificación","NOMBRE DEL GESTOR  O COORDINADOR DE PREVENCIÓN","CORREO DEL RESPONSABLE DEL SISTEMA DE GESTION DE SEGURIDAD Y SALUD EN EL TRABAJO  DE LA EMPRESA","CURSO","FECHA DE APERTURA DEL CURSO",{"$f":"IFERROR(+VLOOKUP(M2,'PRESENCIAL NACIONAL - VIRTUALES'!C:M,11,0),0)","v":0},{"$f":"+COUNTA(A2:A150)","v":0}]
[null,null,null,null,null,null,null,null,null,null,null,null,"Explica el concepto y proceso de reclasificación; cuándo es procendente realizarlo y cuándo no.  ","2019-07-11"]

{"sheet":"Video Reclasificación","index":7,"n_rows":18,"n_cols":2,"rows_kept":18,"cut":false,"hidden":true,"merged":[[17,1,17,7]]}
[]
[]
[]
[]
[]
[]
[]
[]
[]
[]
{"$rows_left_out":9}
{"sheet":"Virtual Cruz Roja","index":8,"n_rows":12,"n_cols":15,"rows_kept":12,"cut":false,"hidden":true,"merged":[[10,8,11,8],[10,9,11,9],[10,10,11,10],[10,11,11,11],[10,12,11,12],[6,1,6,7],[7,1,7,7],[10,7,11,7],[10,0,11,0],[10,1,10,2],[10,3,10,4],[10,5,11,5],[10,6,11,6]]}
[null,null,null,null,null,null,null,null,null,null,null,null,null,{"$f":"IFERROR(+VLOOKUP(B7,'PRESENCIAL NACIONAL - VIRTUALES'!C:M,12,0),0)","v":0},{"$f":"+COUNTA(A13:A1500)","v":0}]
[]
[]
[]
["FORMATO DE INSCRIPCIÓN PROCESOS VIRTUALES"]
[]
["CURSO:"]
["FECHA:"]
[]
["* CAMPOS OBLIGATORIOS Deben ser diligenciado en MAYUSCULAS."]
{"$rows_left_out":3}
{"sheet":"Virtual en línea (Go to webinar","index":9,"n_rows":1,"n_cols":13,"rows_kept":1,"cut":false,"hidden":true,"merged":[]}
["CEDULA","NOMBRE","APELLIDO","CORREO","EMPRESA","NIT sin número de verificación ","TEMA","NOMBRE DEL GESTOR O COORDINADOR DE PREVENCION","HORA","FECHA","LUGAR",{"$f":"IFERROR(+VLOOKUP(G2,'PRESENCIAL NACIONAL - VIRTUALES'!C:M,12,0),0)","v":0},{"$f":"+COUNTA(A2:A1500)","v":0}]

{"sheet":"SENA ALTURA","index":10,"n_rows":17,"n_cols":2,"rows_kept":17,"cut":false,"hidden":true,"merged":[[10,0,16,0],[10,1,10,13],[11,1,11,13],[12,1,12,13],[13,1,13,13],[14,1,14,13],[15,1,15,13],[16,1,16,13],[0,0,0,13],[1,0,1,13],[2,0,2,13],[3,1,3,13],[4,0,9,0],[4,1,4,13],[5,1,5,13],[6,1,6,13],[7,1,7,13],[8,1,8,13],[9,1,9,13]]}
["DIRECTRICES Y MECANISMO DE INSCRIPCIÓN CURSOS ALTURAS CONVENIO SENA"]
["RADICACIÓN DE DOCUMENTOS"]
["Su asesor de prevención le estará remitiendo un correo con la información de inscripciones de los cursos ofertados por parte del SENA en el nivel de formación de Trabajo seguro en alturas (avanzado y reentrenamiento). Allí se brindarán las indicaciones de la fecha límite para radiación de documentos, la dirección y las fechas en que se realizará el curso.                                                                                                                                                                                                                                        Información importante:  Si no es posible para ustedes la fecha que ofrece el SENA, por favor absténgase de enviar la documentación en ese mes, porque una vez inscrito si no hay asistencia, el SENA generará la sanción.   El curso es directo del SENA, Liberty les apoya en el trámite de radicación, por ende, es requerido cumplir con los requisitos aquí descritos y remitir los documentos hasta la fecha límite indicada.  "]
["NIVEL DE FORMACIÓN","REQUISITOS DE INGRESO"]
["Avanzado Trabajo Seguro en Alturas (40 horas)","• Carta de solicitud indicando el nivel de capacitación, debe ir dirigida al Coordinador Académico  Luis Orlando Cortes (Si el trámite es por empresa se debe indicar el NIT)\nSe debe especificar el correo electrónico (para él envió de las novedades y programación disponible).\n"]
[null,"• Certificación médica de aptitud para realizar trabajo en alturas, con vigencia no mayor a un año, realizado por médico especialista en Salud Ocupacional que indique que la persona (trabajador) puede realizar la actividad en alturas."]
[null,"• Afiliación vigente a Seguridad Social (Pagos vigentes EPS-ARL)"]
[null,"• Fotocopia de la CC (legible)"]
[null,"• Competencias de lecto-escritura (Corresponde a la capacidad de leer y escribir - no se debe presentar ningún documento)"]
[null,"• Registro plataforma Sofía Plus www.senasofiaplus.edu.co (adjuntar pantallazo del mismo por cada aspirante)"]
{"$rows_left_out":7}