{"text_format":"1","workbook":"xlsx","n_sheets":11,"sheets":["Menú Inscripciones","Inscripciones","INFORMACION INSCRIPCIONES","Validaciones","PRESENCIAL NACIONAL - VIRTUALES","Cursos Presenciales","Cursos Virtuales","Video Reclasificación","Virtual Cruz Roja","Virtual en línea (Go to webinar","SENA ALTURA"],"not_rendered":{"charts":0,"images":5,"macros":1,"external_links":1,"defined_names":53,"comments":0,"pivot_tables":1},"unopened":[],"bounds":{"document_bytes":16777216,"sheet_cells":100000,"rows_first":2000,"rows_last":500,"rows_between":2000,"halvings":0,"cell_chars":16384,"cell_head_chars":4096},"cells_cut":0,"cells_raw":0,"read":"whole","date_system":"1900"}

{"sheet":"Menú Inscripciones","index":0,"n_rows":0,"n_cols":0,"rows_kept":0,"cut":false,"hidden":false,"merged":[]}

{"sheet":"Inscripciones","index":1,"n_rows":306,"n_cols":12,"rows_kept":306,"cut":false,"hidden":false,"merged":[]}
[]
[]
[]
[]
[]
[]
[]
[]
[]
["PROGRAMA","TEMA","PERFIL ASISTENTES","MODALIDAD","CIUDAD","FECHA","HORARIO","LUGAR","MAXIMO ASISTENTES POR EMPRESA","REALIZAR INSCRIPCION","MODALIDAD"]
[{"$f":"+IF(Validaciones!A5=\"\",\"\",Validaciones!A5)","v":"ATENCION DE LA ENFERMEDAD LABORAL"},{"$f":"+IF(Validaciones!B5=\"\",\"\",Validaciones!B5)","v":"Proceso de definición de enfermedad laboral y calificación, acciones para prevenir los daños en caso de IPP e invalidez, para lograr la rehabilitación integral, procesos de readaptación y reubicación laboral"},{"$f":"+IF(Validaciones!C5=\"\",\"\",Validaciones!C5)","v":"Los participantes deben estar afiliados a la ARL LIBERTY  y  tener a cargo el Sistema de Gestión de Seguridad y Salud en el Trabajo o pertenecer al área de Recursos Humanos o área médica de la empresa."},{"$f":"+IF(Validaciones!D5=\"\",\"\",Validaciones!D5)","v":"VIRTUAL "},{"$f":"+IF(Validaciones!E5=\"\",\"\",Validaciones!E5)","v":"NACIONAL"},{"$f":"+IF(Validaciones!F5=\"\",\"\",Validaciones!F5)","v":"2019-03-01"},{"$f":"+IF(Validaciones!G5=\"\",\"\",Validaciones!G5)","v":"9:00 a 11:00 a.m. "},{"$f":"+IF(Validaciones!H5=\"\",\"\",Validaciones!H5)","v":"Liberty University"},{"$f":"+IF(Validaciones!I5=\"\",\"\",Validaciones!I5)","v":200},null,{"$f":"+IF(Validaciones!I5=\"\",\"\",Validaciones!I5)","v":200},{"$f":"IF(B11=\"\",\"\",+VLOOKUP(B11,'PRESENCIAL NACIONAL - VIRTUALES'!C:N,12,0))","v":0}]
[{"$f":"+IF(Validaciones!A6=\"\",\"\",Validaciones!A6)","v":"ATENCION DEL ACCIDENTE LABORAL "},{"$f":"+IF(Validaciones!B6=\"\",\"\",Validaciones!B6)","v":"Acceso al servicio Asistencial y Reconocimiento de las prestaciones económicas de las contingencias de los accidentes laborales AL y enfermedad laboral EL.\n"},{"$f":"+IF(Validaciones!C6=\"\",\"\",Validaciones!C6)","v":"Los participantes deben estar afiliados a la ARL LIBERTY  y  tener a cargo el Sistema de Gestión de Seguridad y Salud en el Trabajo o pertenecer al área de Recursos Humanos o área médica de la empresa."},{"$f":"+IF(Validaciones!D6=\"\",\"\",Validaciones!D6)","v":"VIRTUAL "},{"$f":"+IF(Validaciones!E6=\"\",\"\",Validaciones!E6)","v":"NACIONAL"},{"$f":"+IF(Validaciones!F6=\"\",\"\",Validaciones!F6)","v":"2019-03-01"},{"$f":"+IF(Validaciones!G6=\"\",\"\",Validaciones!G6)","v":"9:00 - 11:00 a.m."},{"$f":"+IF(Validaciones!H6=\"\",\"\",Validaciones!H6)","v":"Liberty University"},{"$f":"+IF(Validaciones!I6=\"\",\"\",Validaciones!I6)","v":200},null,{"$f":"+IF(Validaciones!I6=\"\",\"\",Validaciones!I6)","v":200},{"$f":"IF(B12=\"\",\"\",+VLOOKUP(B12,'PRESENCIAL NACIONAL - VIRTUALES'!C:N,12,0))","v":0}]
[{"$f":"+IF(Validaciones!A7=\"\",\"\",Validaciones!A7)","v":"COMITÉ DE CONVIVENCIA"},{"$f":"+IF(Validaciones!B7=\"\",\"\",Validaciones!B7)","v":"COMITÉ DE CONVIVENCIA LABORAL (Aula viviendo en armonía)."},{"$f":"+IF(Validaciones!C7=\"\",\"\",Validaciones!C7)","v":"Personal responsable del sistema de gestión, Talento humano y comité de convivencia. "},{"$f":"+IF(Validaciones!D7=\"\",\"\",Validaciones!D7)","v":"VIRTUAL "},{"$f":"+IF(Validaciones!E7=\"\",\"\",Validaciones!E7)","v":"NACIONAL"},{"$f":"+IF(Validaciones!F7=\"\",\"\",Validaciones!F7)","v":"2019-10-31"},{"$f":"+IF(Validaciones!G7=\"\",\"\",Validaciones!G7)","v":"Abierto"},{"$f":"+IF(Validaciones!H7=\"\",\"\",Validaciones!H7)","v":"Liberty University"},{"$f":"+IF(Validaciones!I7=\"\",\"\",Validaciones!I7)","v":200},null,{"$f":"+IF(Validaciones!I7=\"\",\"\",Validaciones!I7)","v":200},{"$f":"IF(B13=\"\",\"\",+VLOOKUP(B13,'PRESENCIAL NACIONAL - VIRTUALES'!C:N,12,0))","v":0}]
[{"$f":"+IF(Validaciones!A8=\"\",\"\",Validaciones!A8)","v":"COPASST"},{"$f":"+IF(Validaciones!B8=\"\",\"\",Validaciones!B8)","v":"Gestión Efectiva del Copasst. Módulo 1. Funciones y responsabilidades frente a dec. 1072 ,Reuniones efectivas, plan de trabajo,  Inspecciones de seguridad  y  auditoria.  "},{"$f":"+IF(Validaciones!C8=\"\",\"\",Validaciones!C8)","v":"Dirigidos a los copasst y vigias de seguridad y salud en el trabajo. "},{"$f":"+IF(Validaciones!D8=\"\",\"\",Validaciones!D8)","v":"PRESENCIAL "},{"$f":"+IF(Validaciones!E8=\"\",\"\",Validaciones!E8)","v":"BARRANQUILLA"},{"$f":"+IF(Validaciones!F8=\"\",\"\",Validaciones!F8)","v":"2019-05-23"},{"$f":"+IF(Validaciones!G8=\"\",\"\",Validaciones!G8)","v":"8:00 a.m. - 12:00 m"},{"$f":"+IF(Validaciones!H8=\"\",\"\",Validaciones!H8)","v":"ICONTEC Cra 57 No. 70-89 Barranquilla"},{"$f":"+IF(Validaciones!I8=\"\",\"\",Validaciones!I8)","v":3},null,{"$f":"+IF(Validaciones!I8=\"\",\"\",Validaciones!I8)","v":3},{"$f":"IF(B14=\"\",\"\",+VLOOKUP(B14,'PRESENCIAL NACIONAL - VIRTUALES'!C:N,12,0))","v":"Montajes y procesos mgonzalez@montajesyprocesos.com"}]
[{"$f":"+IF(Validaciones!A9=\"\",\"\",Validaciones!A9)","v":"COPASST"},{"$f":"+IF(Validaciones!B9=\"\",\"\",Validaciones!B9)","v":"Gestión Efectiva del Copasst. Módulo 1. Funciones y responsabilidades frente a dec. 1072 ,Reuniones efectivas, plan de trabajo,  Inspecciones de seguridad  y  auditoria.  "},{"$f":"+IF(Validaciones!C9=\"\",\"\",Validaciones!C9)","v":"Dirigidos a los copasst y vigias de seguridad y salud en el trabajo. "},{"$f":"+IF(Validaciones!D9=\"\",\"\",Validaciones!D9)","v":"PRESENCIAL "},{"$f":"+IF(Validaciones!E9=\"\",\"\",Validaciones!E9)","v":"BUCARAMANGA"},{"$f":"+IF(Validaciones!F9=\"\",\"\",Validaciones!F9)","v":"2019-03-21"},{"$f":"+IF(Validaciones!G9=\"\",\"\",Validaciones!G9)","v":"8:00 a.m. - 12:00 m"},{"$f":"+IF(Validaciones!H9=\"\",\"\",Validaciones!H9)","v":"CAJASAN Cra 27 No 61-78"},{"$f":"+IF(Validaciones!I9=\"\",\"\",Validaciones!I9)","v":2},null,{"$f":"+IF(Validaciones!I9=\"\",\"\",Validaciones!I9)","v":2},{"$f":"IF(B15=\"\",\"\",+VLOOKUP(B15,'PRESENCIAL NACIONAL - VIRTUALES'!C:N,12,0))","v":"Montajes y procesos mgonzalez@montajesyprocesos.com"}]
[{"$f":"+IF(Validaciones!A10=\"\",\"\",Validaciones!A10)","v":"COPASST"},{"$f":"+IF(Validaciones!B10=\"\",\"\",Validaciones!B10)","v":"Gestión Efectiva del Copasst. Módulo 1. Funciones y responsabilidades frente a dec. 1072 ,Reuniones efectivas, plan de trabajo,  Inspecciones de seguridad  y  auditoria.  "},{"$f":"+IF(Validaciones!C10=\"\",\"\",Validaciones!C10)","v":"Dirigidos a los copasst y vigias de seguridad y salud en el trabajo. "},{"$f":"+IF(Validaciones!D10=\"\",\"\",Validaciones!D10)","v":"PRESENCIAL "},{"$f":"+IF(Validaciones!E10=\"\",\"\",Validaciones!E10)","v":"CALI"},{"$f":"+IF(Validaciones!F10=\"\",\"\",Validaciones!F10)","v":"2019-03-07"},{"$f":"+IF(Validaciones!G10=\"\",\"\",Validaciones!G10)","v":"8:00 a.m. - 12:00 m"},{"$f":"+IF(Validaciones!H10=\"\",\"\",Validaciones!H10)","v":"Av. 5 Norte # 38N-81"},{"$f":"+IF(Validaciones!I10=\"\",\"\",Validaciones!I10)","v":2},null,{"$f":"+IF(Validaciones!I10=\"\",\"\",Validaciones!I10)","v":2},{"$f":"IF(B16=\"\",\"\",+VLOOKUP(B16,'PRESENCIAL NACIONAL - VIRTUALES'!C:N,12,0))","v":"Montajes y procesos mgonzalez@montajesyprocesos.com"}]
[{"$f":"+IF(Validaciones!A11=\"\",\"\",Validaciones!A11)","v":"COPASST"},{"$f":"+IF(Validaciones!B11=\"\",\"\",Validaciones!B11)","v":"Gestión Efectiva del Copasst. Módulo 1. Funciones y responsabilidades frente a dec. 1072 ,Reuniones efectivas, plan de trabajo,  Inspecciones de seguridad  y  auditoria.  "},{"$f":"+IF(Validaciones!C11=\"\",\"\",Validaciones!C11)","v":"Dirigidos a los copasst y vigias de seguridad y salud en el trabajo. "},{"$f":"+IF(Validaciones!D11=\"\",\"\",Validaciones!D11)","v":"PRESENCIAL "},{"$f":"+IF(Validaciones!E11=\"\",\"\",Validaciones!E11)","v":"CARTAGENA"},{"$f":"+IF(Validaciones!F11=\"\",\"\",Validaciones!F11)","v":"2019-03-21"},{"$f":"+IF(Validaciones!G11=\"\",\"\",Validaciones!G11)","v":"8:00 a.m. - 12:00 m"},{"$f":"+IF(Validaciones!H11=\"\",\"\",Validaciones!H11)","v":"Liberty Seguros, Calle del Arsenal No 8B-195 piso 1"},{"$f":"+IF(Validaciones!I11=\"\",\"\",Validaciones!I11)","v":3},null,{"$f":"+IF(Validaciones!I11=\"\",\"\",Validaciones!I11)","v":3},{"$f":"IF(B17=\"\",\"\",+VLOOKUP(B17,'PRESENCIAL NACIONAL - VIRTUALES'!C:N,12,0))","v":"Montajes y procesos mgonzalez@montajesyprocesos.com"}]
[{"$f":"+IF(Validaciones!A12=\"\",\"\",Validaciones!A12)","v":"COPASST"},{"$f":"+IF(Validaciones!B12=\"\",\"\",Validaciones!B12)","v":"Gestión Efectiva del Copasst. Módulo 1. Funciones y responsabilidades frente a dec. 1072 ,Reuniones efectivas, plan de trabajo,  Inspecciones de seguridad  y  auditoria.  "},{"$f":"+IF(Validaciones!C12=\"\",\"\",Validaciones!C12)","v":"Dirigidos a los copasst y vigias de seguridad y salud en el trabajo. "},{"$f":"+IF(Validaciones!D12=\"\",\"\",Validaciones!D12)","v":"PRESENCIAL "},{"$f":"+IF(Validaciones!E12=\"\",\"\",Validaciones!E12)","v":"BOGOTÁ"},{"$f":"+IF(Validaciones!F12=\"\",\"\",Validaciones!F12)","v":"2019-03-21"},{"$f":"+IF(Validaciones!G12=\"\",\"\",Validaciones!G12)","v":"8:00 a.m. - 12:00 m"},{"$f":"+IF(Validaciones!H12=\"\",\"\",Validaciones!H12)","v":"Calle 73 N° 10 - 83 Torre C Oficina 302. Salón 302 Fucsia"},{"$f":"+IF(Validaciones!I12=\"\",\"\",Validaciones!I12)","v":2},null,{"$f":"+IF(Validaciones!I12=\"\",\"\",Validaciones!I12)","v":2},{"$f":"IF(B18=\"\",\"\",+VLOOKUP(B18,'PRESENCIAL NACIONAL - VIRTUALES'!C:N,12,0))","v":"Montajes y procesos mgonzalez@montajesyprocesos.com"}]
[{"$f":"+IF(Validaciones!A13=\"\",\"\",Validaciones!A13)","v":"COPASST"},{"$f":"+IF(Validaciones!B13=\"\",\"\",Validaciones!B13)","v":"Gestión Efectiva del Copasst. Módulo 1. Funciones y responsabilidades frente a dec. 1072 ,Reuniones efectivas, plan de trabajo,  Inspecciones de seguridad  y  auditoria.  "},{"$f":"+IF(Validaciones!C13=\"\",\"\",Validaciones!C13)","v":"Dirigidos a los copasst y vigias de seguridad y salud en el trabajo. "},{"$f":"+IF(Validaciones!D13=\"\",\"\",Validaciones!D13)","v":"PRESENCIAL "},{"$f":"+IF(Validaciones!E13=\"\",\"\",Validaciones!E13)","v":"BOGOTÁ"},{"$f":"+IF(Validaciones!F13=\"\",\"\",Validaciones!F13)","v":"2019-08-29"},{"$f":"+IF(Validaciones!G13=\"\",\"\",Validaciones!G13)","v":"8:00 a.m. - 12:00 m"},{"$f":"+IF(Validaciones!H13=\"\",\"\",Validaciones!H13)","v":"Calle 73 N° 10 - 83 Torre C Oficina 302. Salón 302 Fucsia"},{"$f":"+IF(Validaciones!I13=\"\",\"\",Validaciones!I13)","v":2},null,{"$f":"+IF(Validaciones!I13=\"\",\"\",Validaciones!I13)","v":2},{"$f":"IF(B19=\"\",\"\",+VLOOKUP(B19,'PRESENCIAL NACIONAL - VIRTUALES'!C:N,12,0))","v":"Montajes y procesos mgonzalez@montajesyprocesos.com"}]
[{"$f":"+IF(Validaciones!A14=\"\",\"\",Validaciones!A14)","v":"COPASST"},{"$f":"+IF(Validaciones!B14=\"\",\"\",Validaciones!B14)","v":"Gestión Efectiva del Copasst. Módulo 1. Funciones y responsabilidades frente a dec. 1072 ,Reuniones efectivas, plan de trabajo,  Inspecciones de seguridad  y  auditoria.  "},{"$f":"+IF(Validaciones!C14=\"\",\"\",Validaciones!C14)","v":"Dirigidos a los copasst y vigias de seguridad y salud en el trabajo. "},{"$f":"+IF(Validaciones!D14=\"\",\"\",Validaciones!D14)","v":"PRESENCIAL "},{"$f":"+IF(Validaciones!E14=\"\",\"\",Validaciones!E14)","v":"MEDELLÍN "},{"$f":"+IF(Validaciones!F14=\"\",\"\",Validaciones!F14)","v":"2019-02-21"},{"$f":"+IF(Validaciones!G14=\"\",\"\",Validaciones!G14)","v":"8:00 a.m. - 12:00 m"},{"$f":"+IF(Validaciones!H14=\"\",\"\",Validaciones!H14)","v":"Carrera 43A No 19-17, auditorio piso 4 torre norte Block Empresarial"},{"$f":"+IF(Validaciones!I14=\"\",\"\",Validaciones!I14)","v":4},null,{"$f":"+IF(Validaciones!I14=\"\",\"\",Validaciones!I14)","v":4},{"$f":"IF(B20=\"\",\"\",+VLOOKUP(B20,'PRESENCIAL NACIONAL - VIRTUALES'!C:N,12,0))","v":"Montajes y procesos mgonzalez@montajesyprocesos.com"}]
[{"$f":"+IF(Validaciones!A15=\"\",\"\",Validaciones!A15)","v":"COPASST"},{"$f":"+IF(Validaciones!B15=\"\",\"\",Validaciones!B15)","v":"Gestión Efectiva del Copasst. Módulo 2:  Investigación accidentes de trabajo "},{"$f":"+IF(Validaciones!C15=\"\",\"\",Validaciones!C15)","v":"Dirigidos a los copasst y vigias de seguridad y salud en el trabajo. "},{"$f":"+IF(Validaciones!D15=\"\",\"\",Validaciones!D15)","v":"PRESENCIAL "},{"$f":"+IF(Validaciones!E15=\"\",\"\",Validaciones!E15)","v":"BARRANQUILLA"},{"$f":"+IF(Validaciones!F15=\"\",\"\",Validaciones!F15)","v":"2019-06-06"},{"$f":"+IF(Validaciones!G15=\"\",\"\",Validaciones!G15)","v":"8:00 a.m. - 12:00 m"},{"$f":"+IF(Validaciones!H15=\"\",\"\",Validaciones!H15)","v":"ICONTEC Cra 57 No. 70-89 Barranquilla"},{"$f":"+IF(Validaciones!I15=\"\",\"\",Validaciones!I15)","v":3},null,{"$f":"+IF(Validaciones!I15=\"\",\"\",Validaciones!I15)","v":3},{"$f":"IF(B21=\"\",\"\",+VLOOKUP(B21,'PRESENCIAL NACIONAL - VIRTUALES'!C:N,12,0))","v":0}]
[{"$f":"+IF(Validaciones!A16=\"\",\"\",Validaciones!A16)","v":"COPASST"},{"$f":"+IF(Validaciones!B16=\"\",\"\",Validaciones!B16)","v":"Gestión Efectiva del Copasst. Módulo 2:  Investigación accidentes de trabajo "},{"$f":"+IF(Validaciones!C16=\"\",\"\",Validaciones!C16)","v":"Dirigidos a los copasst y vigias de seguridad y salud en el trabajo. "},{"$f":"+IF(Validaciones!D16=\"\",\"\",Validaciones!D16)","v":"PRESENCIAL "},{"$f":"+IF(Validaciones!E16=\"\",\"\",Validaciones!E16)","v":"BUCARAMANGA"},{"$f":"+IF(Validaciones!F16=\"\",\"\",Validaciones!F16)","v":"2019-04-04"},{"$f":"+IF(Validaciones!G16=\"\",\"\",Validaciones!G16)","v":"8:00 a.m. - 12:00 m"},{"$f":"+IF(Validaciones!H16=\"\",\"\",Validaciones!H16)","v":"Hotel La Triada Cra. 20 #34--22"},{"$f":"+IF(Validaciones!I16=\"\",\"\",Validaciones!I16)","v":2},null,{"$f":"+IF(Validaciones!I16=\"\",\"\",Validaciones!I16)","v":2},{"$f":"IF(B22=\"\",\"\",+VLOOKUP(B22,'PRESENCIAL NACIONAL - VIRTUALES'!C:N,12,0))","v":0}]
[{"$f":"+IF(Validaciones!A17=\"\",\"\",Validaciones!A17)","v":"COPASST"},{"$f":"+IF(Validaciones!B17=\"\",\"\",Validaciones!B17)","v":"Gestión Efectiva del Copasst. Módulo 2:  Investigación accidentes de trabajo "},{"$f":"+IF(Validaciones!C17=\"\",\"\",Validaciones!C17)","v":"Dirigidos a los copasst y vigias de seguridad y salud en el trabajo. "},{"$f":"+IF(Validaciones!D17=\"\",\"\",Validaciones!D17)","v":"PRESENCIAL "},{"$f":"+IF(Validaciones!E17=\"\",\"\",Validaciones!E17)","v":"CALI"},{"$f":"+IF(Validaciones!F17=\"\",\"\",Validaciones!F17)","v":"2019-04-04"},{"$f":"+IF(Validaciones!G17=\"\",\"\",Validaciones!G17)","v":"8:00 a.m. - 12:00 m"},{"$f":"+IF(Validaciones!H17=\"\",\"\",Validaciones!H17)","v":"Av. 5 Norte # 38N-81"},{"$f":"+IF(Validaciones!I17=\"\",\"\",Validaciones!I17)","v":2},null,{"$f":"+IF(Validaciones!I17=\"\",\"\",Validaciones!I17)","v":2},{"$f":"IF(B23=\"\",\"\",+VLOOKUP(B23,'PRESENCIAL NACIONAL - VIRTUALES'!C:N,12,0))","v":0}]
[{"$f":"+IF(Validaciones!A18=\"\",\"\",Validaciones!A18)","v":"COPASST"},{"$f":"+IF(Validaciones!B18=\"\",\"\",Validaciones!B18)","v":"Gestión Efectiva del Copasst. Módulo 2:  Investigación accidentes de trabajo "},{"$f":"+IF(Validaciones!C18=\"\",\"\",Validaciones!C18)","v":"Dirigidos a los copasst y vigias de seguridad y salud en el trabajo. "},{"$f":"+IF(Validaciones!D18=\"\",\"\",Validaciones!D18)","v":"PRESENCIAL "},{"$f":"+IF(Validaciones!E18=\"\",\"\",Validaciones!E18)","v":"CARTAGENA"},{"$f":"+IF(Validaciones!F18=\"\",\"\",Validaciones!F18)","v":"2019-04-04"},{"$f":"+IF(Validaciones!G18=\"\",\"\",Validaciones!G18)","v":"8:00 a.m. - 12:00 m"},{"$f":"+IF(Validaciones!H18=\"\",\"\",Validaciones!H18)","v":"Liberty Seguros, Calle del Arsenal No 8B-195 piso 1"},{"$f":"+IF(Validaciones!I18=\"\",\"\",Validaciones!I18)","v":3},null,{"$f":"+IF(Validaciones!I18=\"\",\"\",Validaciones!I18)","v":3},{"$f":"IF(B24=\"\",\"\",+VLOOKUP(B24,'PRESENCIAL NACIONAL - VIRTUALES'!C:N,12,0))","v":0}]
[{"$f":"+IF(Validaciones!A19=\"\",\"\",Validaciones!A19)","v":"COPASST"},{"$f":"+IF(Validaciones!B19=\"\",\"\",Validaciones!B19)","v":"Gestión Efectiva del Copasst. Módulo 2:  Investigación accidentes de trabajo "},{"$f":"+IF(Validaciones!C19=\"\",\"\",Validaciones!C19)","v":"Dirigidos a los copasst y vigias de seguridad y salud en el trabajo. "},{"$f":"+IF(Validaciones!D19=\"\",\"\",Validaciones!D19)","v":"PRESENCIAL "},{"$f":"+IF(Validaciones!E19=\"\",\"\",Validaciones!E19)","v":"BOGOTÁ"},{"$f":"+IF(Validaciones!F19=\"\",\"\",Validaciones!F19)","v":"2019-09-19"},{"$f":"+IF(Validaciones!G19=\"\",\"\",Validaciones!G19)","v":"8:00 a.m. - 12:00 m"},{"$f":"+IF(Validaciones!H19=\"\",\"\",Validaciones!H19)","v":"Calle 73 N° 10 - 83 Torre C Oficina 302. Salón 302 Fucsia"},{"$f":"+IF(Validaciones!I19=\"\",\"\",Validaciones!I19)","v":2},null,{"$f":"+IF(Validaciones!I19=\"\",\"\",Validaciones!I19)","v":2},{"$f":"IF(B25=\"\",\"\",+VLOOKUP(B25,'PRESENCIAL NACIONAL - VIRTUALES'!C:N,12,0))","v":0}]
[{"$f":"+IF(Validaciones!A20=\"\",\"\",Validaciones!A20)","v":"COPASST"},{"$f":"+IF(Validaciones!B20=\"\",\"\",Validaciones!B20)","v":"Gestión Efectiva del Copasst. Módulo 2:  Investigación accidentes de trabajo "},{"$f":"+IF(Validaciones!C20=\"\",\"\",Validaciones!C20)","v":"Dirigidos a los copasst y vigias de seguridad y salud en el trabajo. "},{"$f":"+IF(Validaciones!D20=\"\",\"\",Validaciones!D20)","v":"PRESENCIAL "},{"$f":"+IF(Validaciones!E20=\"\",\"\",Validaciones!E20)","v":"BOGOTÁ"},{"$f":"+IF(Validaciones!F20=\"\",\"\",Validaciones!F20)","v":"2019-04-04"},{"$f":"+IF(Validaciones!G20=\"\",\"\",Validaciones!G20)","v":"8:00 a.m. - 12:00 m"},{"$f":"+IF(Validaciones!H20=\"\",\"\",Validaciones!H20)","v":"Calle 73 N° 10 - 83 Torre C Oficina 302. Salón 302 Fucsia"},{"$f":"+IF(Validaciones!I20=\"\",\"\",Validaciones!I20)","v":2},null,{"$f":"+IF(Validaciones!I20=\"\",\"\",Validaciones!I20)","v":2},{"$f":"IF(B26=\"\",\"\",+VLOOKUP(B26,'PRESENCIAL NACIONAL - VIRTUALES'!C:N,12,0))","v":0}]
[{"$f":"+IF(Validaciones!A21=\"\",\"\",Validaciones!A21)","v":"COPASST"},{"$f":"+IF(Validaciones!B21=\"\",\"\",Validaciones!B21)","v":"Gestión Efectiva del Copasst. Módulo 2:  Investigación accidentes de trabajo "},{"$f":"+IF(Validaciones!C21=\"\",\"\",Validaciones!C21)","v":"Dirigidos a los copasst y vigias de seguridad y salud en el trabajo. "},{"$f":"+IF(Validaciones!D21=\"\",\"\",Validaciones!D21)","v":"PRESENCIAL "},{"$f":"+IF(Validaciones!E21=\"\",\"\",Validaciones!E21)","v":"MEDELLÍN "},{"$f":"+IF(Validaciones!F21=\"\",\"\",Validaciones!F21)","v":"2019-11-20"},{"$f":"+IF(Validaciones!G21=\"\",\"\",Validaciones!G21)","v":"8:00 a.m. - 12:00 m"},{"$f":"+IF(Validaciones!H21=\"\",\"\",Validaciones!H21)","v":"Carrera 43A No 19-17, auditorio piso 4 torre norte Block Empresarial"},{"$f":"+IF(Validaciones!I21=\"\",\"\",Validaciones!I21)","v":4},null,{"$f":"+IF(Validaciones!I21=\"\",\"\",Validaciones!I21)","v":4},{"$f":"IF(B27=\"\",\"\",+VLOOKUP(B27,'PRESENCIAL NACIONAL - VIRTUALES'!C:N,12,0))","v":0}]
[{"$f":"+IF(Validaciones!A22=\"\",\"\",Validaciones!A22)","v":"EMERGENCIAS"},{"$f":"+IF(Validaciones!B22=\"\",\"\",Validaciones!B22)","v":"BRIGADAS DE EMERGENCIAS (Primeros Auxilios, Control de incendios y Evacuación)"},{"$f":"+IF(Validaciones!C22=\"\",\"\",Validaciones!C22)","v":"Brigadistas"},{"$f":"+IF(Validaciones!D22=\"\",\"\",Validaciones!D22)","v":"VIRTUAL "},{"$f":"+IF(Validaciones!E22=\"\",\"\",Validaciones!E22)","v":"NACIONAL"},{"$f":"+IF(Validaciones!F22=\"\",\"\",Validaciones!F22)","v":"2019-08-05"},{"$f":"+IF(Validaciones!G22=\"\",\"\",Validaciones!G22)","v":"Abierto a partir de agosto"},{"$f":"+IF(Validaciones!H22=\"\",\"\",Validaciones!H22)","v":"curso virtual cruz roja colombiana "},{"$f":"+IF(Validaciones!I22=\"\",\"\",Validaciones!I22)","v":2},null,{"$f":"+IF(Validaciones!I22=\"\",\"\",Validaciones!I22)","v":2},{"$f":"IF(B28=\"\",\"\",+VLOOKUP(B28,'PRESENCIAL NACIONAL - VIRTUALES'!C:N,12,0))","v":"Cruz"}]
[{"$f":"+IF(Validaciones!A23=\"\",\"\",Validaciones!A23)","v":"EMERGENCIAS"},{"$f":"+IF(Validaciones!B23=\"\",\"\",Validaciones!B23)","v":"BRIGADAS DE EMERGENCIAS (Primeros Auxilios, Control de incendios y Evacuación)"},{"$f":"+IF(Validaciones!C23=\"\",\"\",Validaciones!C23)","v":"Brigadistas"},{"$f":"+IF(Validaciones!D23=\"\",\"\",Validaciones!D23)","v":"VIRTUAL "},{"$f":"+IF(Validaciones!E23=\"\",\"\",Validaciones!E23)","v":"NACIONAL"},{"$f":"+IF(Validaciones!F23=\"\",\"\",Validaciones!F23)","v":"2019-03-11"},{"$f":"+IF(Validaciones!G23=\"\",\"\",Validaciones!G23)","v":"Abierto "},{"$f":"+IF(Validaciones!H23=\"\",\"\",Validaciones!H23)","v":"curso virtual cruz roja colombiana "},{"$f":"+IF(Validaciones!I23=\"\",\"\",Validaciones!I23)","v":2},null,{"$f":"+IF(Validaciones!I23=\"\",\"\",Validaciones!I23)","v":2},{"$f":"IF(B29=\"\",\"\",+VLOOKUP(B29,'PRESENCIAL NACIONAL - VIRTUALES'!C:N,12,0))","v":"Cruz"}]
[{"$f":"+IF(Validaciones!A24=\"\",\"\",Validaciones!A24)","v":"EMERGENCIAS"},{"$f":"+IF(Validaciones!B24=\"\",\"\",Validaciones!B24)","v":"Entrenamiento práctico de emergencias  "},{"$f":"+IF(Validaciones!C24=\"\",\"\",Validaciones!C24)","v":"Brigadista con formación teórica "},{"$f":"+IF(Validaciones!D24=\"\",\"\",Validaciones!D24)","v":"PRESENCIAL "},{"$f":"+IF(Validaciones!E24=\"\",\"\",Validaciones!E24)","v":"BARRANCABERMEJA"},{"$f":"+IF(Validaciones!F24=\"\",\"\",Validaciones!F24)","v":"2019-10-25"},{"$f":"+IF(Validaciones!G24=\"\",\"\",Validaciones!G24)","v":"8:00am  - 5:00pm"},{"$f":"+IF(Validaciones!H24=\"\",\"\",Validaciones!H24)","v":"Pendiente por definir"},{"$f":"+IF(Validaciones!I24=\"\",\"\",Validaciones!I24)","v":2},null,{"$f":"+IF(Validaciones!I24=\"\",\"\",Validaciones!I24)","v":2},{"$f":"IF(B30=\"\",\"\",+VLOOKUP(B30,'PRESENCIAL NACIONAL - VIRTUALES'!C:N,12,0))","v":"MG MASTER GROUP SAS"}]
[{"$f":"+IF(Validaciones!A25=\"\",\"\",Validaciones!A25)","v":"EMERGENCIAS"},{"$f":"+IF(Validaciones!B25=\"\",\"\",Validaciones!B25)","v":"Entrenamiento práctico de emergencias  "},{"$f":"+IF(Validaciones!C25=\"\",\"\",Validaciones!C25)","v":"Brigadista con formación teórica "},{"$f":"+IF(Validaciones!D25=\"\",\"\",Validaciones!D25)","v":"PRESENCIAL "},{"$f":"+IF(Validaciones!E25=\"\",\"\",Validaciones!E25)","v":"BARRANQUILLA"},{"$f":"+IF(Validaciones!F25=\"\",\"\",Validaciones!F25)","v":"2019-10-03"},{"$f":"+IF(Validaciones!G25=\"\",\"\",Validaciones!G25)","v":"8:00 am - 5:00 pm"},{"$f":"+IF(Validaciones!H25=\"\",\"\",Validaciones!H25)","v":"Previo a la actividad se estará confirmando lugar del evento "},{"$f":"+IF(Validaciones!I25=\"\",\"\",Validaciones!I25)","v":3},null,{"$f":"+IF(Validaciones!I25=\"\",\"\",Validaciones!I25)","v":3},{"$f":"IF(B31=\"\",\"\",+VLOOKUP(B31,'PRESENCIAL NACIONAL - VIRTUALES'!C:N,12,0))","v":"MG MASTER GROUP SAS"}]
[{"$f":"+IF(Validaciones!A26=\"\",\"\",Validaciones!A26)","v":"EMERGENCIAS"},{"$f":"+IF(Validaciones!B26=\"\",\"\",Validaciones!B26)","v":"Entrenamiento práctico de emergencias  "},{"$f":"+IF(Validaciones!C26=\"\",\"\",Validaciones!C26)","v":"Brigadista con formación teórica "},{"$f":"+IF(Validaciones!D26=\"\",\"\",Validaciones!D26)","v":"PRESENCIAL "},{"$f":"+IF(Validaciones!E26=\"\",\"\",Validaciones!E26)","v":"BUCARAMANGA"},{"$f":"+IF(Validaciones!F26=\"\",\"\",Validaciones!F26)","v":"2019-10-25"},{"$f":"+IF(Validaciones!G26=\"\",\"\",Validaciones!G26)","v":"8:00 am - 5:00 pm"},{"$f":"+IF(Validaciones!H26=\"\",\"\",Validaciones!H26)","v":"CAJASAN Campo Alegre Vía Bucaramanga - Piedecuesta"},{"$f":"+IF(Validaciones!I26=\"\",\"\",Validaciones!I26)","v":2},null,{"$f":"+IF(Validaciones!I26=\"\",\"\",Validaciones!I26)","v":2},{"$f":"IF(B32=\"\",\"\",+VLOOKUP(B32,'PRESENCIAL NACIONAL - VIRTUALES'!C:N,12,0))","v":"MG MASTER GROUP SAS"}]
[{"$f":"+IF(Validaciones!A27=\"\",\"\",Validaciones!A27)","v":"EMERGENCIAS"},{"$f":"+IF(Validaciones!B27=\"\",\"\",Validaciones!B27)","v":"Entrenamiento práctico de emergencias  "},{"$f":"+IF(Validaciones!C27=\"\",\"\",Validaciones!C27)","v":"Brigadista con formación teórica "},{"$f":"+IF(Validaciones!D27=\"\",\"\",Validaciones!D27)","v":"PRESENCIAL "},{"$f":"+IF(Validaciones!E27=\"\",\"\",Validaciones!E27)","v":"CALI"},{"$f":"+IF(Validaciones!F27=\"\",\"\",Validaciones!F27)","v":"2019-07-26"},{"$f":"+IF(Validaciones!G27=\"\",\"\",Validaciones!G27)","v":"8:00 am - 5:00 pm"},{"$f":"+IF(Validaciones!H27=\"\",\"\",Validaciones!H27)","v":"CRA. 2 NRO. 4 - 29   YUMBO"},{"$f":"+IF(Validaciones!I27=\"\",\"\",Validaciones!I27)","v":2},null,{"$f":"+IF(Validaciones!I27=\"\",\"\",Validaciones!I27)","v":2},{"$f":"IF(B33=\"\",\"\",+VLOOKUP(B33,'PRESENCIAL NACIONAL - VIRTUALES'!C:N,12,0))","v":"MG MASTER GROUP SAS"}]
[{"$f":"+IF(Validaciones!A28=\"\",\"\",Validaciones!A28)","v":"EMERGENCIAS"},{"$f":"+IF(Validaciones!B28=\"\",\"\",Validaciones!B28)","v":"Entrenamiento práctico de emergencias  "},{"$f":"+IF(Validaciones!C28=\"\",\"\",Validaciones!C28)","v":"Brigadista con formación teórica "},{"$f":"+IF(Validaciones!D28=\"\",\"\",Validaciones!D28)","v":"PRESENCIAL "},{"$f":"+IF(Validaciones!E28=\"\",\"\",Validaciones!E28)","v":"CALI"},{"$f":"+IF(Validaciones!F28=\"\",\"\",Validaciones!F28)","v":"2019-10-25"},{"$f":"+IF(Validaciones!G28=\"\",\"\",Validaciones!G28)","v":"8:00 am - 5:00 pm"},{"$f":"+IF(Validaciones!H28=\"\",\"\",Validaciones!H28)","v":"CRA. 2 NRO. 4 - 29   YUMBO"},{"$f":"+IF(Validaciones!I28=\"\",\"\",Validaciones!I28)","v":2},null,{"$f":"+IF(Validaciones!I28=\"\",\"\",Validaciones!I28)","v":2},{"$f":"IF(B34=\"\",\"\",+VLOOKUP(B34,'PRESENCIAL NACIONAL - VIRTUALES'!C:N,12,0))","v":"MG MASTER GROUP SAS"}]
[{"$f":"+IF(Validaciones!A29=\"\",\"\",Validaciones!A29)","v":"EMERGENCIAS"},{"$f":"+IF(Validaciones!B29=\"\",\"\",Validaciones!B29)","v":"Entrenamiento práctico de emergencias  "},{"$f":"+IF(Validaciones!C29=\"\",\"\",Validaciones!C29)","v":"Brigadista con formación teórica "},{"$f":"+IF(Validaciones!D29=\"\",\"\",Validaciones!D29)","v":"PRESENCIAL "},{"$f":"+IF(Validaciones!E29=\"\",\"\",Validaciones!E29)","v":"CARTAGENA"},{"$f":"+IF(Validaciones!F29=\"\",\"\",Validaciones!F29)","v":"2019-10-25"},{"$f":"+IF(Validaciones!G29=\"\",\"\",Validaciones!G29)","v":"8:00 am - 5:00 pm"},{"$f":"+IF(Validaciones!H29=\"\",\"\",Validaciones!H29)","v":"Previo a la actividad se estará confirmando lugar del evento "},{"$f":"+IF(Validaciones!I29=\"\",\"\",Validaciones!I29)","v":2},null,{"$f":"+IF(Validaciones!I29=\"\",\"\",Validaciones!I29)","v":2},{"$f":"IF(B35=\"\",\"\",+VLOOKUP(B35,'PRESENCIAL NACIONAL - VIRTUALES'!C:N,12,0))","v":"MG MASTER GROUP SAS"}]
[{"$f":"+IF(Validaciones!A30=\"\",\"\",Validaciones!A30)","v":"EMERGENCIAS"},{"$f":"+IF(Validaciones!B30=\"\",\"\",Validaciones!B30)","v":"Entrenamiento práctico de emergencias  "},{"$f":"+IF(Validaciones!C30=\"\",\"\",Validaciones!C30)","v":"Brigadista con formación teórica "},{"$f":"+IF(Validaciones!D30=\"\",\"\",Validaciones!D30)","v":"PRESENCIAL "},{"$f":"+IF(Validaciones!E30=\"\",\"\",Validaciones!E30)","v":"MEDELLÍN "},{"$f":"+IF(Validaciones!F30=\"\",\"\",Validaciones!F30)","v":"2019-04-05"},{"$f":"+IF(Validaciones!G30=\"\",\"\",Validaciones!G30)","v":"8:00 am - 5:00 pm"},{"$f":"+IF(Validaciones!H30=\"\",\"\",Validaciones!H30)","v":"Calle 36 D sur N° 23 -07 Envigado."},{"$f":"+IF(Validaciones!I30=\"\",\"\",Validaciones!I30)","v":4},null,{"$f":"+IF(Validaciones!I30=\"\",\"\",Validaciones!I30)","v":4},{"$f":"IF(B36=\"\",\"\",+VLOOKUP(B36,'PRESENCIAL NACIONAL - VIRTUALES'!C:N,12,0))","v":"MG MASTER GROUP SAS"}]
[{"$f":"+IF(Validaciones!A31=\"\",\"\",Validaciones!A31)","v":"EMERGENCIAS"},{"$f":"+IF(Validaciones!B31=\"\",\"\",Validaciones!B31)","v":"Entrenamiento práctico de emergencias  "},{"$f":"+IF(Validaciones!C31=\"\",\"\",Validaciones!C31)","v":"Brigadista con formación teórica "},{"$f":"+IF(Validaciones!D31=\"\",\"\",Validaciones!D31)","v":"PRESENCIAL "},{"$f":"+IF(Validaciones!E31=\"\",\"\",Validaciones!E31)","v":"MEDELLÍN "},{"$f":"+IF(Validaciones!F31=\"\",\"\",Validaciones!F31)","v":"2019-10-18"},{"$f":"+IF(Validaciones!G31=\"\",\"\",Validaciones!G31)","v":"8:00 am - 5:00 pm"},{"$f":"+IF(Validaciones!H31=\"\",\"\",Validaciones!H31)","v":"Calle 36 D sur N° 23 -07 Envigado."},{"$f":"+IF(Validaciones!I31=\"\",\"\",Validaciones!I31)","v":4},null,{"$f":"+IF(Validaciones!I31=\"\",\"\",Validaciones!I31)","v":4},{"$f":"IF(B37=\"\",\"\",+VLOOKUP(B37,'PRESENCIAL NACIONAL - VIRTUALES'!C:N,12,0))","v":"MG MASTER GROUP SAS"}]
[{"$f":"+IF(Validaciones!A32=\"\",\"\",Validaciones!A32)","v":"EMERGENCIAS"},{"$f":"+IF(Validaciones!B32=\"\",\"\",Validaciones!B32)","v":"Curso de emergencias.  Módulo 1. Primeros auxilios "},{"$f":"+IF(Validaciones!C32=\"\",\"\",Validaciones!C32)","v":"Brigadistas"},{"$f":"+IF(Validaciones!D32=\"\",\"\",Validaciones!D32)","v":"PRESENCIAL "},{"$f":"+IF(Validaciones!E32=\"\",\"\",Validaciones!E32)","v":"BARRANCABERMEJA"},{"$f":"+IF(Validaciones!F32=\"\",\"\",Validaciones!F32)","v":"2019-04-11"},{"$f":"+IF(Validaciones!G32=\"\",\"\",Validaciones!G32)","v":"8:00 a.m. - 12:00 m"},{"$f":"+IF(Validaciones!H32=\"\",\"\",Validaciones!H32)","v":"Hotel San Silvestre Cra 19 # 58a–13"},{"$f":"+IF(Validaciones!I32=\"\",\"\",Validaciones!I32)","v":2},null,{"$f":"+IF(Validaciones!I32=\"\",\"\",Validaciones!I32)","v":2},{"$f":"IF(B38=\"\",\"\",+VLOOKUP(B38,'PRESENCIAL NACIONAL - VIRTUALES'!C:N,12,0))","v":0}]
[{"$f":"+IF(Validaciones!A33=\"\",\"\",Validaciones!A33)","v":"EMERGENCIAS"},{"$f":"+IF(Validaciones!B33=\"\",\"\",Validaciones!B33)","v":"Curso de emergencias.  Módulo 1. Primeros auxilios "},{"$f":"+IF(Validaciones!C33=\"\",\"\",Validaciones!C33)","v":"Brigadistas"},{"$f":"+IF(Validaciones!D33=\"\",\"\",Validaciones!D33)","v":"PRESENCIAL "},{"$f":"+IF(Validaciones!E33=\"\",\"\",Validaciones!E33)","v":"BARRANQUILLA"},{"$f":"+IF(Validaciones!F33=\"\",\"\",Validaciones!F33)","v":"2019-08-15"},{"$f":"+IF(Validaciones!G33=\"\",\"\",Validaciones!G33)","v":"8:00 a.m. - 12:00 m"},{"$f":"+IF(Validaciones!H33=\"\",\"\",Validaciones!H33)","v":"ICONTEC Cra 57 No. 70-89 Barranquilla"},{"$f":"+IF(Validaciones!I33=\"\",\"\",Validaciones!I33)","v":3},null,{"$f":"+IF(Validaciones!I33=\"\",\"\",Validaciones!I33)","v":3},{"$f":"IF(B39=\"\",\"\",+VLOOKUP(B39,'PRESENCIAL NACIONAL - VIRTUALES'!C:N,12,0))","v":0}]
[{"$f":"+IF(Validaciones!A34=\"\",\"\",Validaciones!A34)","v":"EMERGENCIAS"},{"$f":"+IF(Validaciones!B34=\"\",\"\",Validaciones!B34)","v":"Curso de emergencias.  Módulo 1. Primeros auxilios "},{"$f":"+IF(Validaciones!C34=\"\",\"\",Validaciones!C34)","v":"Brigadistas"},{"$f":"+IF(Validaciones!D34=\"\",\"\",Validaciones!D34)","v":"PRESENCIAL "},{"$f":"+IF(Validaciones!E34=\"\",\"\",Validaciones!E34)","v":"BUCARAMANGA"},{"$f":"+IF(Validaciones!F34=\"\",\"\",Validaciones!F34)","v":"2019-04-11"},{"$f":"+IF(Validaciones!G34=\"\",\"\",Validaciones!G34)","v":"8:00 a.m. - 12:00 m"},{"$f":"+IF(Validaciones!H34=\"\",\"\",Validaciones!H34)","v":"CAJASAN Campo Alegre Vía Bucaramanga - Piedecuesta"},{"$f":"+IF(Validaciones!I34=\"\",\"\",Validaciones!I34)","v":2},null,{"$f":"+IF(Validaciones!I34=\"\",\"\",Validaciones!I34)","v":2},{"$f":"IF(B40=\"\",\"\",+VLOOKUP(B40,'PRESENCIAL NACIONAL - VIRTUALES'!C:N,12,0))","v":0}]
[{"$f":"+IF(Validaciones!A35=\"\",\"\",Validaciones!A35)","v":"EMERGENCIAS"},{"$f":"+IF(Validaciones!B35=\"\",\"\",Validaciones!B35)","v":"Curso de emergencias.  Módulo 1. Primeros auxilios "},{"$f":"+IF(Validaciones!C35=\"\",\"\",Validaciones!C35)","v":"Brigadistas"},{"$f":"+IF(Validaciones!D35=\"\",\"\",Validaciones!D35)","v":"PRESENCIAL "},{"$f":"+IF(Validaciones!E35=\"\",\"\",Validaciones!E35)","v":"CALI"},{"$f":"+IF(Validaciones!F35=\"\",\"\",Validaciones!F35)","v":"2019-04-12"},{"$f":"+IF(Validaciones!G35=\"\",\"\",Validaciones!G35)","v":"8:00 a.m. - 12:00 m"},{"$f":"+IF(Validaciones!H35=\"\",\"\",Validaciones!H35)","v":"Av. 5 Norte # 38N-81"},{"$f":"+IF(Validaciones!I35=\"\",\"\",Validaciones!I35)","v":2},null,{"$f":"+IF(Validaciones!I35=\"\",\"\",Validaciones!I35)","v":2},{"$f":"IF(B41=\"\",\"\",+VLOOKUP(B41,'PRESENCIAL NACIONAL - VIRTUALES'!C:N,12,0))","v":0}]
[{"$f":"+IF(Validaciones!A36=\"\",\"\",Validaciones!A36)","v":"EMERGENCIAS"},{"$f":"+IF(Validaciones!B36=\"\",\"\",Validaciones!B36)","v":"Curso de emergencias.  Módulo 1. Primeros auxilios "},{"$f":"+IF(Validaciones!C36=\"\",\"\",Validaciones!C36)","v":"Brigadistas"},{"$f":"+IF(Validaciones!D36=\"\",\"\",Validaciones!D36)","v":"PRESENCIAL "},{"$f":"+IF(Validaciones!E36=\"\",\"\",Validaciones!E36)","v":"CARTAGENA"},{"$f":"+IF(Validaciones!F36=\"\",\"\",Validaciones!F36)","v":"2019-04-11"},{"$f":"+IF(Validaciones!G36=\"\",\"\",Validaciones!G36)","v":"8:00 a.m. - 12:00 m"},{"$f":"+IF(Validaciones!H36=\"\",\"\",Validaciones!H36)","v":"Liberty Seguros, Calle del Arsenal No 8B-195 piso 1"},{"$f":"+IF(Validaciones!I36=\"\",\"\",Validaciones!I36)","v":3},null,{"$f":"+IF(Validaciones!I36=\"\",\"\",Validaciones!I36)","v":3},{"$f":"IF(B42=\"\",\"\",+VLOOKUP(B42,'PRESENCIAL NACIONAL - VIRTUALES'!C:N,12,0))","v":0}]
[{"$f":"+IF(Validaciones!A37=\"\",\"\",Validaciones!A37)","v":"EMERGENCIAS"},{"$f":"+IF(Validaciones!B37=\"\",\"\",Validaciones!B37)","v":"Curso de emergencias.  Módulo 1. Primeros auxilios "},{"$f":"+IF(Validaciones!C37=\"\",\"\",Validaciones!C37)","v":"Brigadistas"},{"$f":"+IF(Validaciones!D37=\"\",\"\",Validaciones!D37)","v":"PRESENCIAL "},{"$f":"+IF(Validaciones!E37=\"\",\"\",Validaciones!E37)","v":"BOGOTÁ"},{"$f":"+IF(Validaciones!F37=\"\",\"\",Validaciones!F37)","v":"2019-04-11"},{"$f":"+IF(Validaciones!G37=\"\",\"\",Validaciones!G37)","v":"8:00 a.m. - 12:00 m"},{"$f":"+IF(Validaciones!H37=\"\",\"\",Validaciones!H37)","v":"Calle 73 N° 10 - 83 Torre C Oficina 302. Salón 302 Fucsia"},{"$f":"+IF(Validaciones!I37=\"\",\"\",Validaciones!I37)","v":2},null,{"$f":"+IF(Validaciones!I37=\"\",\"\",Validaciones!I37)","v":2},{"$f":"IF(B43=\"\",\"\",+VLOOKUP(B43,'PRESENCIAL NACIONAL - VIRTUALES'!C:N,12,0))","v":0}]
[{"$f":"+IF(Validaciones!A38=\"\",\"\",Validaciones!A38)","v":"EMERGENCIAS"},{"$f":"+IF(Validaciones!B38=\"\",\"\",Validaciones!B38)","v":"Curso de emergencias.  Módulo 1. Primeros auxilios "},{"$f":"+IF(Validaciones!C38=\"\",\"\",Validaciones!C38)","v":"Brigadistas"},{"$f":"+IF(Validaciones!D38=\"\",\"\",Validaciones!D38)","v":"PRESENCIAL "},{"$f":"+IF(Validaciones!E38=\"\",\"\",Validaciones!E38)","v":"MEDELLÍN "},{"$f":"+IF(Validaciones!F38=\"\",\"\",Validaciones!F38)","v":"2019-04-11"},{"$f":"+IF(Validaciones!G38=\"\",\"\",Validaciones!G38)","v":"8:00 a.m. - 12:00 m"},{"$f":"+IF(Validaciones!H38=\"\",\"\",Validaciones!H38)","v":"Carrera 43A No 19-17, auditorio piso 4 torre norte Block Empresarial"},{"$f":"+IF(Validaciones!I38=\"\",\"\",Validaciones!I38)","v":"(en blanco)"},null,{"$f":"+IF(Validaciones!I38=\"\",\"\",Validaciones!I38)","v":"(en blanco)"},{"$f":"IF(B44=\"\",\"\",+VLOOKUP(B44,'PRESENCIAL NACIONAL - VIRTUALES'!C:N,12,0))","v":0}]
[{"$f":"+IF(Validaciones!A39=\"\",\"\",Validaciones!A39)","v":"EMERGENCIAS"},{"$f":"+IF(Validaciones!B39=\"\",\"\",Validaciones!B39)","v":"Curso de emergencias.  Módulo 2. Evacuación y plan de emergencia."},{"$f":"+IF(Validaciones!C39=\"\",\"\",Validaciones!C39)","v":"Brigadistas"},{"$f":"+IF(Validaciones!D39=\"\",\"\",Validaciones!D39)","v":"PRESENCIAL "},{"$f":"+IF(Validaciones!E39=\"\",\"\",Validaciones!E39)","v":"BARRANCABERMEJA"},{"$f":"+IF(Validaciones!F39=\"\",\"\",Validaciones!F39)","v":"2019-05-16"},{"$f":"+IF(Validaciones!G39=\"\",\"\",Validaciones!G39)","v":"8:00 a.m. - 12:00 m"},{"$f":"+IF(Validaciones!H39=\"\",\"\",Validaciones!H39)","v":"Hotel San Silvestre Cra 19 # 58a–13"},{"$f":"+IF(Validaciones!I39=\"\",\"\",Validaciones!I39)","v":2},null,{"$f":"+IF(Validaciones!I39=\"\",\"\",Validaciones!I39)","v":2},{"$f":"IF(B45=\"\",\"\",+VLOOKUP(B45,'PRESENCIAL NACIONAL - VIRTUALES'!C:N,12,0))","v":0}]
[{"$f":"+IF(Validaciones!A40=\"\",\"\",Validaciones!A40)","v":"EMERGENCIAS"},{"$f":"+IF(Validaciones!B40=\"\",\"\",Validaciones!B40)","v":"Curso de emergencias.  Módulo 2. Evacuación y plan de emergencia."},{"$f":"+IF(Validaciones!C40=\"\",\"\",Validaciones!C40)","v":"Brigadistas"},{"$f":"+IF(Validaciones!D40=\"\",\"\",Validaciones!D40)","v":"PRESENCIAL "},{"$f":"+IF(Validaciones!E40=\"\",\"\",Validaciones!E40)","v":"BARRANQUILLA"},{"$f":"+IF(Validaciones!F40=\"\",\"\",Validaciones!F40)","v":"2019-09-05"},{"$f":"+IF(Validaciones!G40=\"\",\"\",Validaciones!G40)","v":"8:00 a.m. - 12:00 m"},{"$f":"+IF(Validaciones!H40=\"\",\"\",Validaciones!H40)","v":"ICONTEC Cra 57 No. 70-89 Barranquilla"},{"$f":"+IF(Validaciones!I40=\"\",\"\",Validaciones!I40)","v":3},null,{"$f":"+IF(Validaciones!I40=\"\",\"\",Validaciones!I40)","v":3},{"$f":"IF(B46=\"\",\"\",+VLOOKUP(B46,'PRESENCIAL NACIONAL - VIRTUALES'!C:N,12,0))","v":0}]
[{"$f":"+IF(Validaciones!A41=\"\",\"\",Validaciones!A41)","v":"EMERGENCIAS"},{"$f":"+IF(Validaciones!B41=\"\",\"\",Validaciones!B41)","v":"Curso de emergencias.  Módulo 2. Evacuación y plan de emergencia."},{"$f":"+IF(Validaciones!C41=\"\",\"\",Validaciones!C41)","v":"Brigadistas"},{"$f":"+IF(Validaciones!D41=\"\",\"\",Validaciones!D41)","v":"PRESENCIAL "},{"$f":"+IF(Validaciones!E41=\"\",\"\",Validaciones!E41)","v":"BUCARAMANGA"},{"$f":"+IF(Validaciones!F41=\"\",\"\",Validaciones!F41)","v":"2019-05-16"},{"$f":"+IF(Validaciones!G41=\"\",\"\",Validaciones!G41)","v":"8:00 a.m. - 12:00 m"},{"$f":"+IF(Validaciones!H41=\"\",\"\",Validaciones!H41)","v":"CAJASAN Campo Alegre Vía Bucaramanga - Piedecuesta"},{"$f":"+IF(Validaciones!I41=\"\",\"\",Validaciones!I41)","v":2},null,{"$f":"+IF(Validaciones!I41=\"\",\"\",Validaciones!I41)","v":2},{"$f":"IF(B47=\"\",\"\",+VLOOKUP(B47,'PRESENCIAL NACIONAL - VIRTUALES'!C:N,12,0))","v":0}]
[{"$f":"+IF(Validaciones!A42=\"\",\"\",Validaciones!A42)","v":"EMERGENCIAS"},{"$f":"+IF(Validaciones!B42=\"\",\"\",Validaciones!B42)","v":"Curso de emergencias.  Módulo 2. Evacuación y plan de emergencia."},{"$f":"+IF(Validaciones!C42=\"\",\"\",Validaciones!C42)","v":"Brigadistas"},{"$f":"+IF(Validaciones!D42=\"\",\"\",Validaciones!D42)","v":"PRESENCIAL "},{"$f":"+IF(Validaciones!E42=\"\",\"\",Validaciones!E42)","v":"CALI"},{"$f":"+IF(Validaciones!F42=\"\",\"\",Validaciones!F42)","v":"2019-05-17"},{"$f":"+IF(Validaciones!G42=\"\",\"\",Validaciones!G42)","v":"8:00 a.m. - 12:00 m"},{"$f":"+IF(Validaciones!H42=\"\",\"\",Validaciones!H42)","v":"Av. 5 Norte # 38N-81"},{"$f":"+IF(Validaciones!I42=\"\",\"\",Validaciones!I42)","v":2},null,{"$f":"+IF(Validaciones!I42=\"\",\"\",Validaciones!I42)","v":2},{"$f":"IF(B48=\"\",\"\",+VLOOKUP(B48,'PRESENCIAL NACIONAL - VIRTUALES'!C:N,12,0))","v":0}]
[{"$f":"+IF(Validaciones!A43=\"\",\"\",Validaciones!A43)","v":"EMERGENCIAS"},{"$f":"+IF(Validaciones!B43=\"\",\"\",Validaciones!B43)","v":"Curso de emergencias.  Módulo 2. Evacuación y plan de emergencia."},{"$f":"+IF(Validaciones!C43=\"\",\"\",Validaciones!C43)","v":"Brigadistas"},{"$f":"+IF(Validaciones!D43=\"\",\"\",Validaciones!D43)","v":"PRESENCIAL "},{"$f":"+IF(Validaciones!E43=\"\",\"\",Validaciones!E43)","v":"CARTAGENA"},{"$f":"+IF(Validaciones!F43=\"\",\"\",Validaciones!F43)","v":"2019-05-16"},{"$f":"+IF(Validaciones!G43=\"\",\"\",Validaciones!G43)","v":"8:00 a.m. - 12:00 m"},{"$f":"+IF(Validaciones!H43=\"\",\"\",Validaciones!H43)","v":"Liberty Seguros, Calle del Arsenal No 8B-195 piso 1"},{"$f":"+IF(Validaciones!I43=\"\",\"\",Validaciones!I43)","v":3},null,{"$f":"+IF(Validaciones!I43=\"\",\"\",Validaciones!I43)","v":3},{"$f":"IF(B49=\"\",\"\",+VLOOKUP(B49,'PRESENCIAL NACIONAL - VIRTUALES'!C:N,12,0))","v":0}]
[{"$f":"+IF(Validaciones!A44=\"\",\"\",Validaciones!A44)","v":"EMERGENCIAS"},{"$f":"+IF(Validaciones!B44=\"\",\"\",Validaciones!B44)","v":"Curso de emergencias.  Módulo 2. Evacuación y plan de emergencia."},{"$f":"+IF(Validaciones!C44=\"\",\"\",Validaciones!C44)","v":"Brigadistas"},{"$f":"+IF(Validaciones!D44=\"\",\"\",Validaciones!D44)","v":"PRESENCIAL "},{"$f":"+IF(Validaciones!E44=\"\",\"\",Validaciones!E44)","v":"BOGOTÁ"},{"$f":"+IF(Validaciones!F44=\"\",\"\",Validaciones!F44)","v":"2019-05-16"},{"$f":"+IF(Validaciones!G44=\"\",\"\",Validaciones!G44)","v":"8:00 a.m. - 12:00 m"},{"$f":"+IF(Validaciones!H44=\"\",\"\",Validaciones!H44)","v":"Calle 73 N° 10 - 83 Torre C Oficina 302. Salón 302 Fucsia"},{"$f":"+IF(Validaciones!I44=\"\",\"\",Validaciones!I44)","v":2},null,{"$f":"+IF(Validaciones!I44=\"\",\"\",Validaciones!I44)","v":2},{"$f":"IF(B50=\"\",\"\",+VLOOKUP(B50,'PRESENCIAL NACIONAL - VIRTUALES'!C:N,12,0))","v":0}]
[{"$f":"+IF(Validaciones!A45=\"\",\"\",Validaciones!A45)","v":"EMERGENCIAS"},{"$f":"+IF(Validaciones!B45=\"\",\"\",Validaciones!B45)","v":"Curso de emergencias.  Módulo 2. Evacuación y plan de emergencia."},{"$f":"+IF(Validaciones!C45=\"\",\"\",Validaciones!C45)","v":"Brigadistas"},{"$f":"+IF(Validaciones!D45=\"\",\"\",Validaciones!D45)","v":"PRESENCIAL "},{"$f":"+IF(Validaciones!E45=\"\",\"\",Validaciones!E45)","v":"MEDELLÍN "},{"$f":"+IF(Validaciones!F45=\"\",\"\",Validaciones!F45)","v":"2019-05-16"},{"$f":"+IF(Validaciones!G45=\"\",\"\",Validaciones!G45)","v":"8:00 a.m. - 12:00 m"},{"$f":"+IF(Validaciones!H45=\"\",\"\",Validaciones!H45)","v":"Carrera 43A No 19-17, auditorio piso 4 torre norte Block Empresarial"},{"$f":"+IF(Validaciones!I45=\"\",\"\",Validaciones!I45)","v":"(en blanco)"},null,{"$f":"+IF(Validaciones!I45=\"\",\"\",Validaciones!I45)","v":"(en blanco)"},{"$f":"IF(B51=\"\",\"\",+VLOOKUP(B51,'PRESENCIAL NACIONAL - VIRTUALES'!C:N,12,0))","v":0}]
[{"$f":"+IF(Validaciones!A46=\"\",\"\",Validaciones!A46)","v":"EMERGENCIAS"},{"$f":"+IF(Validaciones!B46=\"\",\"\",Validaciones!B46)","v":"Curso de emergencias.  Módulo 3. Contraincendio y recursos para emergencias.  "},{"$f":"+IF(Validaciones!C46=\"\",\"\",Validaciones!C46)","v":"Brigadistas"},{"$f":"+IF(Validaciones!D46=\"\",\"\",Validaciones!D46)","v":"PRESENCIAL "},{"$f":"+IF(Validaciones!E46=\"\",\"\",Validaciones!E46)","v":"BARRANCABERMEJA"},{"$f":"+IF(Validaciones!F46=\"\",\"\",Validaciones!F46)","v":"2019-06-13"},{"$f":"+IF(Validaciones!G46=\"\",\"\",Validaciones!G46)","v":"8:00 a.m. - 12:00 m"},{"$f":"+IF(Validaciones!H46=\"\",\"\",Validaciones!H46)","v":"Hotel San Silvestre Cra 19 # 58a–13"},{"$f":"+IF(Validaciones!I46=\"\",\"\",Validaciones!I46)","v":2},null,{"$f":"+IF(Validaciones!I46=\"\",\"\",Validaciones!I46)","v":2},{"$f":"IF(B52=\"\",\"\",+VLOOKUP(B52,'PRESENCIAL NACIONAL - VIRTUALES'!C:N,12,0))","v":0}]
[{"$f":"+IF(Validaciones!A47=\"\",\"\",Validaciones!A47)","v":"EMERGENCIAS"},{"$f":"+IF(Validaciones!B47=\"\",\"\",Validaciones!B47)","v":"Curso de emergencias.  Módulo 3. Contraincendio y recursos para emergencias.  "},{"$f":"+IF(Validaciones!C47=\"\",\"\",Validaciones!C47)","v":"Brigadistas"},{"$f":"+IF(Validaciones!D47=\"\",\"\",Validaciones!D47)","v":"PRESENCIAL "},{"$f":"+IF(Validaciones!E47=\"\",\"\",Validaciones!E47)","v":"BARRANQUILLA"},{"$f":"+IF(Validaciones!F47=\"\",\"\",Validaciones!F47)","v":"2019-09-19"},{"$f":"+IF(Validaciones!G47=\"\",\"\",Validaciones!G47)","v":"8:00 a.m. - 12:00 m"},{"$f":"+IF(Validaciones!H47=\"\",\"\",Validaciones!H47)","v":"ICONTEC Cra 57 No. 70-89 Barranquilla"},{"$f":"+IF(Validaciones!I47=\"\",\"\",Validaciones!I47)","v":3},null,{"$f":"+IF(Validaciones!I47=\"\",\"\",Validaciones!I47)","v":3},{"$f":"IF(B53=\"\",\"\",+VLOOKUP(B53,'PRESENCIAL NACIONAL - VIRTUALES'!C:N,12,0))","v":0}]
[{"$f":"+IF(Validaciones!A48=\"\",\"\",Validaciones!A48)","v":"EMERGENCIAS"},{"$f":"+IF(Validaciones!B48=\"\",\"\",Validaciones!B48)","v":"Curso de emergencias.  Módulo 3. Contraincendio y recursos para emergencias.  "},{"$f":"+IF(Validaciones!C48=\"\",\"\",Validaciones!C48)","v":"Brigadistas"},{"$f":"+IF(Validaciones!D48=\"\",\"\",Validaciones!D48)","v":"PRESENCIAL "},{"$f":"+IF(Validaciones!E48=\"\",\"\",Validaciones!E48)","v":"BUCARAMANGA"},{"$f":"+IF(Validaciones!F48=\"\",\"\",Validaciones!F48)","v":"2019-06-13"},{"$f":"+IF(Validaciones!G48=\"\",\"\",Validaciones!G48)","v":"8:00 a.m. - 12:00 m"},{"$f":"+IF(Validaciones!H48=\"\",\"\",Validaciones!H48)","v":"CAJASAN Campo Alegre Vía Bucaramanga - Piedecuesta"},{"$f":"+IF(Validaciones!I48=\"\",\"\",Validaciones!I48)","v":2},null,{"$f":"+IF(Validaciones!I48=\"\",\"\",Validaciones!I48)","v":2},{"$f":"IF(B54=\"\",\"\",+VLOOKUP(B54,'PRESENCIAL NACIONAL - VIRTUALES'!C:N,12,0))","v":0}]
[{"$f":"+IF(Validaciones!A49=\"\",\"\",Validaciones!A49)","v":"EMERGENCIAS"},{"$f":"+IF(Validaciones!B49=\"\",\"\",Validaciones!B49)","v":"Curso de emergencias.  Módulo 3. Contraincendio y recursos para emergencias.  "},{"$f":"+IF(Validaciones!C49=\"\",\"\",Validaciones!C49)","v":"Brigadistas"},{"$f":"+IF(Validaciones!D49=\"\",\"\",Validaciones!D49)","v":"PRESENCIAL "},{"$f":"+IF(Validaciones!E49=\"\",\"\",Validaciones!E49)","v":"CALI"},{"$f":"+IF(Validaciones!F49=\"\",\"\",Validaciones!F49)","v":"2019-06-14"},{"$f":"+IF(Validaciones!G49=\"\",\"\",Validaciones!G49)","v":"8:00 a.m. - 12:00 m"},{"$f":"+IF(Validaciones!H49=\"\",\"\",Validaciones!H49)","v":"Av. 5 Norte # 38N-81"},{"$f":"+IF(Validaciones!I49=\"\",\"\",Validaciones!I49)","v":2},null,{"$f":"+IF(Validaciones!I49=\"\",\"\",Validaciones!I49)","v":2},{"$f":"IF(B55=\"\",\"\",+VLOOKUP(B55,'PRESENCIAL NACIONAL - VIRTUALES'!C:N,12,0))","v":0}]
[{"$f":"+IF(Validaciones!A50=\"\",\"\",Validaciones!A50)","v":"EMERGENCIAS"},{"$f":"+IF(Validaciones!B50=\"\",\"\",Validaciones!B50)","v":"Curso de emergencias.  Módulo 3. Contraincendio y recursos para emergencias.  "},{"$f":"+IF(Validaciones!C50=\"\",\"\",Validaciones!C50)","v":"Brigadistas"},{"$f":"+IF(Validaciones!D50=\"\",\"\",Validaciones!D50)","v":"PRESENCIAL "},{"$f":"+IF(Validaciones!E50=\"\",\"\",Validaciones!E50)","v":"CARTAGENA"},{"$f":"+IF(Validaciones!F50=\"\",\"\",Validaciones!F50)","v":"2019-06-13"},{"$f":"+IF(Validaciones!G50=\"\",\"\",Validaciones!G50)","v":"8:00 a.m. - 12:00 m"},{"$f":"+IF(Validaciones!H50=\"\",\"\",Validaciones!H50)","v":"Liberty Seguros, Calle del Arsenal No 8B-195 piso 1"},{"$f":"+IF(Validaciones!I50=\"\",\"\",Validaciones!I50)","v":3},null,{"$f":"+IF(Validaciones!I50=\"\",\"\",Validaciones!I50)","v":3},{"$f":"IF(B56=\"\",\"\",+VLOOKUP(B56,'PRESENCIAL NACIONAL - VIRTUALES'!C:N,12,0))","v":0}]
[{"$f":"+IF(Validaciones!A51=\"\",\"\",Validaciones!A51)","v":"EMERGENCIAS"},{"$f":"+IF(Validaciones!B51=\"\",\"\",Validaciones!B51)","v":"Curso de emergencias.  Módulo 3. Contraincendio y recursos para emergencias.  "},{"$f":"+IF(Validaciones!C51=\"\",\"\",Validaciones!C51)","v":"Brigadistas"},{"$f":"+IF(Validaciones!D51=\"\",\"\",Validaciones!D51)","v":"PRESENCIAL "},{"$f":"+IF(Validaciones!E51=\"\",\"\",Validaciones!E51)","v":"BOGOTÁ"},{"$f":"+IF(Validaciones!F51=\"\",\"\",Validaciones!F51)","v":"2019-06-13"},{"$f":"+IF(Validaciones!G51=\"\",\"\",Validaciones!G51)","v":"8:00 a.m. - 12:00 m"},{"$f":"+IF(Validaciones!H51=\"\",\"\",Validaciones!H51)","v":"Calle 73 N° 10 - 83 Torre C Oficina 302. Salón 302 Fucsia"},{"$f":"+IF(Validaciones!I51=\"\",\"\",Validaciones!I51)","v":2},null,{"$f":"+IF(Validaciones!I51=\"\",\"\",Validaciones!I51)","v":2},{"$f":"IF(B57=\"\",\"\",+VLOOKUP(B57,'PRESENCIAL NACIONAL - VIRTUALES'!C:N,12,0))","v":0}]
[{"$f":"+IF(Validaciones!A52=\"\",\"\",Validaciones!A52)","v":"EMERGENCIAS"},{"$f":"+IF(Validaciones!B52=\"\",\"\",Validaciones!B52)","v":"Curso de emergencias.  Módulo 3. Contraincendio y recursos para emergencias.  "},{"$f":"+IF(Validaciones!C52=\"\",\"\",Validaciones!C52)","v":"Brigadistas"},{"$f":"+IF(Validaciones!D52=\"\",\"\",Validaciones!D52)","v":"PRESENCIAL "},{"$f":"+IF(Validaciones!E52=\"\",\"\",Validaciones!E52)","v":"MEDELLÍN "},{"$f":"+IF(Validaciones!F52=\"\",\"\",Validaciones!F52)","v":"2019-06-13"},{"$f":"+IF(Validaciones!G52=\"\",\"\",Validaciones!G52)","v":"8:00 a.m. - 12:00 m"},{"$f":"+IF(Validaciones!H52=\"\",\"\",Validaciones!H52)","v":"Carrera 43A No 19-17, auditorio piso 4 torre norte Block Empresarial"},{"$f":"+IF(Validaciones!I52=\"\",\"\",Validaciones!I52)","v":"(en blanco)"},null,{"$f":"+IF(Validaciones!I52=\"\",\"\",Validaciones!I52)","v":"(en blanco)"},{"$f":"IF(B58=\"\",\"\",+VLOOKUP(B58,'PRESENCIAL NACIONAL - VIRTUALES'!C:N,12,0))","v":0}]
[{"$f":"+IF(Validaciones!A53=\"\",\"\",Validaciones!A53)","v":"EMERGENCIAS"},{"$f":"+IF(Validaciones!B53=\"\",\"\",Validaciones!B53)","v":"Entrenamiento práctico de emergencias"},{"$f":"+IF(Validaciones!C53=\"\",\"\",Validaciones!C53)","v":"Brigadista con formación teórica "},{"$f":"+IF(Validaciones!D53=\"\",\"\",Validaciones!D53)","v":"PRESENCIAL "},{"$f":"+IF(Validaciones!E53=\"\",\"\",Validaciones!E53)","v":"BOGOTÁ"},{"$f":"+IF(Validaciones!F53=\"\",\"\",Validaciones!F53)","v":"2019-07-26"},{"$f":"+IF(Validaciones!G53=\"\",\"\",Validaciones!G53)","v":"8:00 am - 5:00 pm"},{"$f":"+IF(Validaciones!H53=\"\",\"\",Validaciones!H53)","v":"Pista San José "},{"$f":"+IF(Validaciones!I53=\"\",\"\",Validaciones!I53)","v":2},null,{"$f":"+IF(Validaciones!I53=\"\",\"\",Validaciones!I53)","v":2},{"$f":"IF(B59=\"\",\"\",+VLOOKUP(B59,'PRESENCIAL NACIONAL - VIRTUALES'!C:N,12,0))","v":0}]
[{"$f":"+IF(Validaciones!A54=\"\",\"\",Validaciones!A54)","v":"EMERGENCIAS"},{"$f":"+IF(Validaciones!B54=\"\",\"\",Validaciones!B54)","v":"Entrenamiento práctico de emergencias"},{"$f":"+IF(Validaciones!C54=\"\",\"\",Validaciones!C54)","v":"Brigadista con formación teórica "},{"$f":"+IF(Validaciones!D54=\"\",\"\",Validaciones!D54)","v":"PRESENCIAL "},{"$f":"+IF(Validaciones!E54=\"\",\"\",Validaciones!E54)","v":"BOGOTÁ"},{"$f":"+IF(Validaciones!F54=\"\",\"\",Validaciones!F54)","v":"2019-04-26"},{"$f":"+IF(Validaciones!G54=\"\",\"\",Validaciones!G54)","v":"8:00 am - 5:00 pm"},{"$f":"+IF(Validaciones!H54=\"\",\"\",Validaciones!H54)","v":"Pista San José "},{"$f":"+IF(Validaciones!I54=\"\",\"\",Validaciones!I54)","v":2},null,{"$f":"+IF(Validaciones!I54=\"\",\"\",Validaciones!I54)","v":2},{"$f":"IF(B60=\"\",\"\",+VLOOKUP(B60,'PRESENCIAL NACIONAL - VIRTUALES'!C:N,12,0))","v":0}]
[{"$f":"+IF(Validaciones!A55=\"\",\"\",Validaciones!A55)","v":"ENTRENAMIENTO GERENCIAL "},{"$f":"+IF(Validaciones!B55=\"\",\"\",Validaciones!B55)","v":"Estabilidad laboral reforzada un reto organizacional"},{"$f":"+IF(Validaciones!C55=\"\",\"\",Validaciones!C55)","v":"Gerentes de empresas afiliadas"},{"$f":"+IF(Validaciones!D55=\"\",\"\",Validaciones!D55)","v":"PRESENCIAL "},{"$f":"+IF(Validaciones!E55=\"\",\"\",Validaciones!E55)","v":"BARRANCABERMEJA"},{"$f":"+IF(Validaciones!F55=\"\",\"\",Validaciones!F55)","v":"2019-03-14"},{"$f":"+IF(Validaciones!G55=\"\",\"\",Validaciones!G55)","v":"8:00 am - 10:00 a.m."},{"$f":"+IF(Validaciones!H55=\"\",\"\",Validaciones!H55)","v":"Hotel San Silvestre Cra 19 # 58a–13"},{"$f":"+IF(Validaciones!I55=\"\",\"\",Validaciones!I55)","v":2},null,{"$f":"+IF(Validaciones!I55=\"\",\"\",Validaciones!I55)","v":2},{"$f":"IF(B61=\"\",\"\",+VLOOKUP(B61,'PRESENCIAL NACIONAL - VIRTUALES'!C:N,12,0))","v":0}]
[{"$f":"+IF(Validaciones!A56=\"\",\"\",Validaciones!A56)","v":"ENTRENAMIENTO GERENCIAL "},{"$f":"+IF(Validaciones!B56=\"\",\"\",Validaciones!B56)","v":"Estabilidad laboral reforzada un reto organizacional"},{"$f":"+IF(Validaciones!C56=\"\",\"\",Validaciones!C56)","v":"Gerentes de empresas afiliadas"},{"$f":"+IF(Validaciones!D56=\"\",\"\",Validaciones!D56)","v":"PRESENCIAL "},{"$f":"+IF(Validaciones!E56=\"\",\"\",Validaciones!E56)","v":"BARRANQUILLA"},{"$f":"+IF(Validaciones!F56=\"\",\"\",Validaciones!F56)","v":"2019-03-19"},{"$f":"+IF(Validaciones!G56=\"\",\"\",Validaciones!G56)","v":"8:00 am - 10:00 a.m."},{"$f":"+IF(Validaciones!H56=\"\",\"\",Validaciones!H56)","v":"ICONTEC Cra 57 No. 70-89 Barranquilla"},{"$f":"+IF(Validaciones!I56=\"\",\"\",Validaciones!I56)","v":3},null,{"$f":"+IF(Validaciones!I56=\"\",\"\",Validaciones!I56)","v":3},{"$f":"IF(B62=\"\",\"\",+VLOOKUP(B62,'PRESENCIAL NACIONAL - VIRTUALES'!C:N,12,0))","v":0}]
[{"$f":"+IF(Validaciones!A57=\"\",\"\",Validaciones!A57)","v":"ENTRENAMIENTO GERENCIAL "},{"$f":"+IF(Validaciones!B57=\"\",\"\",Validaciones!B57)","v":"Estabilidad laboral reforzada un reto organizacional"},{"$f":"+IF(Validaciones!C57=\"\",\"\",Validaciones!C57)","v":"Gerentes de empresas afiliadas"},{"$f":"+IF(Validaciones!D57=\"\",\"\",Validaciones!D57)","v":"PRESENCIAL "},{"$f":"+IF(Validaciones!E57=\"\",\"\",Validaciones!E57)","v":"BUCARAMANGA"},{"$f":"+IF(Validaciones!F57=\"\",\"\",Validaciones!F57)","v":"2019-03-07"},{"$f":"+IF(Validaciones!G57=\"\",\"\",Validaciones!G57)","v":"8:00 am - 10:00 a.m."},{"$f":"+IF(Validaciones!H57=\"\",\"\",Validaciones!H57)","v":"Hotel La Triada Cra. 20 #34--22"},{"$f":"+IF(Validaciones!I57=\"\",\"\",Validaciones!I57)","v":2},null,{"$f":"+IF(Validaciones!I57=\"\",\"\",Validaciones!I57)","v":2},{"$f":"IF(B63=\"\",\"\",+VLOOKUP(B63,'PRESENCIAL NACIONAL - VIRTUALES'!C:N,12,0))","v":0}]
[{"$f":"+IF(Validaciones!A58=\"\",\"\",Validaciones!A58)","v":"ENTRENAMIENTO GERENCIAL "},{"$f":"+IF(Validaciones!B58=\"\",\"\",Validaciones!B58)","v":"Estabilidad laboral reforzada un reto organizacional"},{"$f":"+IF(Validaciones!C58=\"\",\"\",Validaciones!C58)","v":"Gerentes de empresas afiliadas"},{"$f":"+IF(Validaciones!D58=\"\",\"\",Validaciones!D58)","v":"PRESENCIAL "},{"$f":"+IF(Validaciones!E58=\"\",\"\",Validaciones!E58)","v":"CALI"},{"$f":"+IF(Validaciones!F58=\"\",\"\",Validaciones!F58)","v":"2019-03-14"},{"$f":"+IF(Validaciones!G58=\"\",\"\",Validaciones!G58)","v":"8:00 am - 10:00 a.m."},{"$f":"+IF(Validaciones!H58=\"\",\"\",Validaciones!H58)","v":"Club de Ejecutivos Av. 4N # 23DN - 65 Piso 9"},{"$f":"+IF(Validaciones!I58=\"\",\"\",Validaciones!I58)","v":2},null,{"$f":"+IF(Validaciones!I58=\"\",\"\",Validaciones!I58)","v":2},{"$f":"IF(B64=\"\",\"\",+VLOOKUP(B64,'PRESENCIAL NACIONAL - VIRTUALES'!C:N,12,0))","v":0}]
[{"$f":"+IF(Validaciones!A59=\"\",\"\",Validaciones!A59)","v":"ENTRENAMIENTO GERENCIAL "},{"$f":"+IF(Validaciones!B59=\"\",\"\",Validaciones!B59)","v":"Estabilidad laboral reforzada un reto organizacional"},{"$f":"+IF(Validaciones!C59=\"\",\"\",Validaciones!C59)","v":"Gerentes de empresas afiliadas"},{"$f":"+IF(Validaciones!D59=\"\",\"\",Validaciones!D59)","v":"PRESENCIAL "},{"$f":"+IF(Validaciones!E59=\"\",\"\",Validaciones!E59)","v":"CARTAGENA"},{"$f":"+IF(Validaciones!F59=\"\",\"\",Validaciones!F59)","v":"2019-03-07"},{"$f":"+IF(Validaciones!G59=\"\",\"\",Validaciones!G59)","v":"8:00 am - 10:00 a.m."},{"$f":"+IF(Validaciones!H59=\"\",\"\",Validaciones!H59)","v":"Liberty Seguros, Calle del Arsenal No 8B-195 piso 1"},{"$f":"+IF(Validaciones!I59=\"\",\"\",Validaciones!I59)","v":2},null,{"$f":"+IF(Validaciones!I59=\"\",\"\",Validaciones!I59)","v":2},{"$f":"IF(B65=\"\",\"\",+VLOOKUP(B65,'PRESENCIAL NACIONAL - VIRTUALES'!C:N,12,0))","v":0}]
[{"$f":"+IF(Validaciones!A60=\"\",\"\",Validaciones!A60)","v":"ENTRENAMIENTO GERENCIAL "},{"$f":"+IF(Validaciones!B60=\"\",\"\",Validaciones!B60)","v":"Estabilidad laboral reforzada un reto organizacional"},{"$f":"+IF(Validaciones!C60=\"\",\"\",Validaciones!C60)","v":"Gerentes de empresas afiliadas"},{"$f":"+IF(Validaciones!D60=\"\",\"\",Validaciones!D60)","v":"PRESENCIAL "},{"$f":"+IF(Validaciones!E60=\"\",\"\",Validaciones!E60)","v":"BOGOTÁ"},{"$f":"+IF(Validaciones!F60=\"\",\"\",Validaciones!F60)","v":"2019-08-28"},{"$f":"+IF(Validaciones!G60=\"\",\"\",Validaciones!G60)","v":"8:00 am - 10:00 a.m."},{"$f":"+IF(Validaciones!H60=\"\",\"\",Validaciones!H60)","v":"Calle 73 N° 10 - 83 Torre C Oficina 302. Salón 302 Fucsia"},{"$f":"+IF(Validaciones!I60=\"\",\"\",Validaciones!I60)","v":2},null,{"$f":"+IF(Validaciones!I60=\"\",\"\",Validaciones!I60)","v":2},{"$f":"IF(B66=\"\",\"\",+VLOOKUP(B66,'PRESENCIAL NACIONAL - VIRTUALES'!C:N,12,0))","v":0}]
[{"$f":"+IF(Validaciones!A61=\"\",\"\",Validaciones!A61)","v":"ENTRENAMIENTO GERENCIAL "},{"$f":"+IF(Validaciones!B61=\"\",\"\",Validaciones!B61)","v":"Estabilidad laboral reforzada un reto organizacional"},{"$f":"+IF(Validaciones!C61=\"\",\"\",Validaciones!C61)","v":"Gerentes empresas afiliadas ARL Liberty "},{"$f":"+IF(Validaciones!D61=\"\",\"\",Validaciones!D61)","v":"PRESENCIAL "},{"$f":"+IF(Validaciones!E61=\"\",\"\",Validaciones!E61)","v":"BOGOTÁ"},{"$f":"+IF(Validaciones!F61=\"\",\"\",Validaciones!F61)","v":"2019-03-07"},{"$f":"+IF(Validaciones!G61=\"\",\"\",Validaciones!G61)","v":"8:00 am - 10:00 a.m."},{"$f":"+IF(Validaciones!H61=\"\",\"\",Validaciones!H61)","v":"Calle 72 # 10 -07   AUDITORIO Piso 6"},{"$f":"+IF(Validaciones!I61=\"\",\"\",Validaciones!I61)","v":2},null,{"$f":"+IF(Validaciones!I61=\"\",\"\",Validaciones!I61)","v":2},{"$f":"IF(B67=\"\",\"\",+VLOOKUP(B67,'PRESENCIAL NACIONAL - VIRTUALES'!C:N,12,0))","v":0}]
[{"$f":"+IF(Validaciones!A62=\"\",\"\",Validaciones!A62)","v":"ENTRENAMIENTO GERENCIAL "},{"$f":"+IF(Validaciones!B62=\"\",\"\",Validaciones!B62)","v":"Rentabilidad en seguridad y salud en el trabajo. "},{"$f":"+IF(Validaciones!C62=\"\",\"\",Validaciones!C62)","v":"Gerentes de empresas afiliadas"},{"$f":"+IF(Validaciones!D62=\"\",\"\",Validaciones!D62)","v":"PRESENCIAL "},{"$f":"+IF(Validaciones!E62=\"\",\"\",Validaciones!E62)","v":"BOGOTÁ"},{"$f":"+IF(Validaciones!F62=\"\",\"\",Validaciones!F62)","v":"2019-06-20"},{"$f":"+IF(Validaciones!G62=\"\",\"\",Validaciones!G62)","v":"8:00 am - 10:00 a.m."},{"$f":"+IF(Validaciones!H62=\"\",\"\",Validaciones!H62)","v":"Calle 72 # 10 -07   AUDITORIO Piso 6"},{"$f":"+IF(Validaciones!I62=\"\",\"\",Validaciones!I62)","v":2},null,{"$f":"+IF(Validaciones!I62=\"\",\"\",Validaciones!I62)","v":2},{"$f":"IF(B68=\"\",\"\",+VLOOKUP(B68,'PRESENCIAL NACIONAL - VIRTUALES'!C:N,12,0))","v":0}]
[{"$f":"+IF(Validaciones!A63=\"\",\"\",Validaciones!A63)","v":"ENTRENAMIENTO GERENCIAL "},{"$f":"+IF(Validaciones!B63=\"\",\"\",Validaciones!B63)","v":"Tendencias globales en Seguridad y salud en el trabajo "},{"$f":"+IF(Validaciones!C63=\"\",\"\",Validaciones!C63)","v":"Gerentes de empresas afiliadas"},{"$f":"+IF(Validaciones!D63=\"\",\"\",Validaciones!D63)","v":"PRESENCIAL "},{"$f":"+IF(Validaciones!E63=\"\",\"\",Validaciones!E63)","v":"BUCARAMANGA"},{"$f":"+IF(Validaciones!F63=\"\",\"\",Validaciones!F63)","v":"2019-08-22"},{"$f":"+IF(Validaciones!G63=\"\",\"\",Validaciones!G63)","v":"8:00 am - 10:00 a.m."},{"$f":"+IF(Validaciones!H63=\"\",\"\",Validaciones!H63)","v":"Hotel La Triada Cra. 20 #34--22"},{"$f":"+IF(Validaciones!I63=\"\",\"\",Validaciones!I63)","v":2},null,{"$f":"+IF(Validaciones!I63=\"\",\"\",Validaciones!I63)","v":2},{"$f":"IF(B69=\"\",\"\",+VLOOKUP(B69,'PRESENCIAL NACIONAL - VIRTUALES'!C:N,12,0))","v":0}]
[{"$f":"+IF(Validaciones!A64=\"\",\"\",Validaciones!A64)","v":"ENTRENAMIENTO GERENCIAL "},{"$f":"+IF(Validaciones!B64=\"\",\"\",Validaciones!B64)","v":"Tendencias globales en Seguridad y salud en el trabajo "},{"$f":"+IF(Validaciones!C64=\"\",\"\",Validaciones!C64)","v":"Gerentes de empresas afiliadas"},{"$f":"+IF(Validaciones!D64=\"\",\"\",Validaciones!D64)","v":"PRESENCIAL "},{"$f":"+IF(Validaciones!E64=\"\",\"\",Validaciones!E64)","v":"CALI"},{"$f":"+IF(Validaciones!F64=\"\",\"\",Validaciones!F64)","v":"2019-08-22"},{"$f":"+IF(Validaciones!G64=\"\",\"\",Validaciones!G64)","v":"8:00 am - 10:00 a.m."},{"$f":"+IF(Validaciones!H64=\"\",\"\",Validaciones!H64)","v":"Club de Ejecutivos Av. 4N # 23DN - 65 Piso 9\n"},{"$f":"+IF(Validaciones!I64=\"\",\"\",Validaciones!I64)","v":2},null,{"$f":"+IF(Validaciones!I64=\"\",\"\",Validaciones!I64)","v":2},{"$f":"IF(B70=\"\",\"\",+VLOOKUP(B70,'PRESENCIAL NACIONAL - VIRTUALES'!C:N,12,0))","v":0}]
[{"$f":"+IF(Validaciones!A65=\"\",\"\",Validaciones!A65)","v":"ENTRENAMIENTO GERENCIAL "},{"$f":"+IF(Validaciones!B65=\"\",\"\",Validaciones!B65)","v":"Tendencias globales en Seguridad y salud en el trabajo "},{"$f":"+IF(Validaciones!C65=\"\",\"\",Validaciones!C65)","v":"Gerentes de empresas afiliadas"},{"$f":"+IF(Validaciones!D65=\"\",\"\",Validaciones!D65)","v":"PRESENCIAL "},{"$f":"+IF(Validaciones!E65=\"\",\"\",Validaciones!E65)","v":"MEDELLÍN "},{"$f":"+IF(Validaciones!F65=\"\",\"\",Validaciones!F65)","v":"2019-09-19"},{"$f":"+IF(Validaciones!G65=\"\",\"\",Validaciones!G65)","v":"8:00 am - 10:00 a.m."},{"$f":"+IF(Validaciones!H65=\"\",\"\",Validaciones!H65)","v":"Previo a la actividad se estará confirmando lugar del evento "},{"$f":"+IF(Validaciones!I65=\"\",\"\",Validaciones!I65)","v":2},null,{"$f":"+IF(Validaciones!I65=\"\",\"\",Validaciones!I65)","v":2},{"$f":"IF(B71=\"\",\"\",+VLOOKUP(B71,'PRESENCIAL NACIONAL - VIRTUALES'!C:N,12,0))","v":0}]
[{"$f":"+IF(Validaciones!A66=\"\",\"\",Validaciones!A66)","v":"ENTRENAMIENTO GERENCIAL "},{"$f":"+IF(Validaciones!B66=\"\",\"\",Validaciones!B66)","v":"continuidad y sostenibilidad del negocio desde SST"},{"$f":"+IF(Validaciones!C66=\"\",\"\",Validaciones!C66)","v":"Gerentes de empresas afiliadas"},{"$f":"+IF(Validaciones!D66=\"\",\"\",Validaciones!D66)","v":"PRESENCIAL "},{"$f":"+IF(Validaciones!E66=\"\",\"\",Validaciones!E66)","v":"MEDELLÍN "},{"$f":"+IF(Validaciones!F66=\"\",\"\",Validaciones!F66)","v":"2019-05-16"},{"$f":"+IF(Validaciones!G66=\"\",\"\",Validaciones!G66)","v":"8:00 am - 10:00 a.m."},{"$f":"+IF(Validaciones!H66=\"\",\"\",Validaciones!H66)","v":"Previo a la actividad se estará confirmando lugar del evento "},{"$f":"+IF(Validaciones!I66=\"\",\"\",Validaciones!I66)","v":2},null,{"$f":"+IF(Validaciones!I66=\"\",\"\",Validaciones!I66)","v":2},{"$f":"IF(B72=\"\",\"\",+VLOOKUP(B72,'PRESENCIAL NACIONAL - VIRTUALES'!C:N,12,0))","v":0}]
[{"$f":"+IF(Validaciones!A67=\"\",\"\",Validaciones!A67)","v":"ENTRENAMIENTO GERENCIAL "},{"$f":"+IF(Validaciones!B67=\"\",\"\",Validaciones!B67)","v":"Sostenibilidad: Una fuerza transformadora de la seguridad y salud en el trabajo."},{"$f":"+IF(Validaciones!C67=\"\",\"\",Validaciones!C67)","v":"Gerentes de empresas afiliadas"},{"$f":"+IF(Validaciones!D67=\"\",\"\",Validaciones!D67)","v":"PRESENCIAL "},{"$f":"+IF(Validaciones!E67=\"\",\"\",Validaciones!E67)","v":"BOGOTÁ"},{"$f":"+IF(Validaciones!F67=\"\",\"\",Validaciones!F67)","v":"2019-11-28"},{"$f":"+IF(Validaciones!G67=\"\",\"\",Validaciones!G67)","v":"8:00 am - 10:00 a.m."},{"$f":"+IF(Validaciones!H67=\"\",\"\",Validaciones!H67)","v":"Calle 73 N° 10 - 83 Torre C Oficina 302. Salón 302 Fucsia"},{"$f":"+IF(Validaciones!I67=\"\",\"\",Validaciones!I67)","v":2},null,{"$f":"+IF(Validaciones!I67=\"\",\"\",Validaciones!I67)","v":2},{"$f":"IF(B73=\"\",\"\",+VLOOKUP(B73,'PRESENCIAL NACIONAL - VIRTUALES'!C:N,12,0))","v":"Montajes y procesos mgonzalez@montajesyprocesos.com"}]
[{"$f":"+IF(Validaciones!A68=\"\",\"\",Validaciones!A68)","v":"ENTRENAMIENTOS ADMINISTRATIVOS"},{"$f":"+IF(Validaciones!B68=\"\",\"\",Validaciones!B68)","v":"Capacitación para independientes y afiliados sobre los deberes y derechos en el  SGRL y definiciones según normatividad"},{"$f":"+IF(Validaciones!C68=\"\",\"\",Validaciones!C68)","v":"Empresas  e independientes voluntarios - mayor información en:\nAtención al cliente - tel. 3077050 "},{"$f":"+IF(Validaciones!D68=\"\",\"\",Validaciones!D68)","v":"PRESENCIAL "},{"$f":"+IF(Validaciones!E68=\"\",\"\",Validaciones!E68)","v":"BARRANQUILLA"},{"$f":"+IF(Validaciones!F68=\"\",\"\",Validaciones!F68)","v":"2019-01-23"},{"$f":"+IF(Validaciones!G68=\"\",\"\",Validaciones!G68)","v":"8:00 AM - 11:00A M"},{"$f":"+IF(Validaciones!H68=\"\",\"\",Validaciones!H68)","v":"Calle 77 No. 59 - 35 OFC 1403 CENTRO EMPRESARIAL AMERICAS 3"},{"$f":"+IF(Validaciones!I68=\"\",\"\",Validaciones!I68)","v":3},null,{"$f":"+IF(Validaciones!I68=\"\",\"\",Validaciones!I68)","v":3},{"$f":"IF(B74=\"\",\"\",+VLOOKUP(B74,'PRESENCIAL NACIONAL - VIRTUALES'!C:N,12,0))","v":0}]
[{"$f":"+IF(Validaciones!A69=\"\",\"\",Validaciones!A69)","v":"ENTRENAMIENTOS ADMINISTRATIVOS"},{"$f":"+IF(Validaciones!B69=\"\",\"\",Validaciones!B69)","v":"Capacitación para independientes y afiliados sobre los deberes y derechos en el  SGRL y definiciones según normatividad"},{"$f":"+IF(Validaciones!C69=\"\",\"\",Validaciones!C69)","v":"Empresas  e independientes voluntarios - mayor información en:\nAtención al cliente - tel. 3077050 "},{"$f":"+IF(Validaciones!D69=\"\",\"\",Validaciones!D69)","v":"PRESENCIAL "},{"$f":"+IF(Validaciones!E69=\"\",\"\",Validaciones!E69)","v":"BARRANQUILLA"},{"$f":"+IF(Validaciones!F69=\"\",\"\",Validaciones!F69)","v":"2019-02-13"},{"$f":"+IF(Validaciones!G69=\"\",\"\",Validaciones!G69)","v":"8:00 AM - 11:00A M"},{"$f":"+IF(Validaciones!H69=\"\",\"\",Validaciones!H69)","v":"Calle 77 No. 59 - 35 OFC 1403 CENTRO EMPRESARIAL AMERICAS 3"},{"$f":"+IF(Validaciones!I69=\"\",\"\",Validaciones!I69)","v":3},null,{"$f":"+IF(Validaciones!I69=\"\",\"\",Validaciones!I69)","v":3},{"$f":"IF(B75=\"\",\"\",+VLOOKUP(B75,'PRESENCIAL NACIONAL - VIRTUALES'!C:N,12,0))","v":0}]
[{"$f":"+IF(Validaciones!A70=\"\",\"\",Validaciones!A70)","v":"ENTRENAMIENTOS ADMINISTRATIVOS"},{"$f":"+IF(Validaciones!B70=\"\",\"\",Validaciones!B70)","v":"Capacitación para independientes y afiliados sobre los deberes y derechos en el  SGRL y definiciones según normatividad"},{"$f":"+IF(Validaciones!C70=\"\",\"\",Validaciones!C70)","v":"Empresas  e independientes voluntarios - mayor información en:\nAtención al cliente - tel. 3077050 "},{"$f":"+IF(Validaciones!D70=\"\",\"\",Validaciones!D70)","v":"PRESENCIAL "},{"$f":"+IF(Validaciones!E70=\"\",\"\",Validaciones!E70)","v":"BARRANQUILLA"},{"$f":"+IF(Validaciones!F70=\"\",\"\",Validaciones!F70)","v":"2019-03-13"},{"$f":"+IF(Validaciones!G70=\"\",\"\",Validaciones!G70)","v":"8:00 AM - 11:00A M"},{"$f":"+IF(Validaciones!H70=\"\",\"\",Validaciones!H70)","v":"Calle 77 No. 59 - 35 OFC 1403 CENTRO EMPRESARIAL AMERICAS 3"},{"$f":"+IF(Validaciones!I70=\"\",\"\",Validaciones!I70)","v":3},null,{"$f":"+IF(Validaciones!I70=\"\",\"\",Validaciones!I70)","v":3},{"$f":"IF(B76=\"\",\"\",+VLOOKUP(B76,'PRESENCIAL NACIONAL - VIRTUALES'!C:N,12,0))","v":0}]
[{"$f":"+IF(Validaciones!A71=\"\",\"\",Validaciones!A71)","v":"ENTRENAMIENTOS ADMINISTRATIVOS"},{"$f":"+IF(Validaciones!B71=\"\",\"\",Validaciones!B71)","v":"Capacitación para independientes y afiliados sobre los deberes y derechos en el  SGRL y definiciones según normatividad"},{"$f":"+IF(Validaciones!C71=\"\",\"\",Validaciones!C71)","v":"Empresas  e independientes voluntarios - mayor información en:\nAtención al cliente - tel. 3077050 "},{"$f":"+IF(Validaciones!D71=\"\",\"\",Validaciones!D71)","v":"PRESENCIAL "},{"$f":"+IF(Validaciones!E71=\"\",\"\",Validaciones!E71)","v":"BARRANQUILLA"},{"$f":"+IF(Validaciones!F71=\"\",\"\",Validaciones!F71)","v":"2019-04-10"},{"$f":"+IF(Validaciones!G71=\"\",\"\",Validaciones!G71)","v":"8:00 AM - 11:00A M"},{"$f":"+IF(Validaciones!H71=\"\",\"\",Validaciones!H71)","v":"Calle 77 No. 59 - 35 OFC 1403 CENTRO EMPRESARIAL AMERICAS 3"},{"$f":"+IF(Validaciones!I71=\"\",\"\",Validaciones!I71)","v":3},null,{"$f":"+IF(Validaciones!I71=\"\",\"\",Validaciones!I71)","v":3},{"$f":"IF(B77=\"\",\"\",+VLOOKUP(B77,'PRESENCIAL NACIONAL - VIRTUALES'!C:N,12,0))","v":0}]
[{"$f":"+IF(Validaciones!A72=\"\",\"\",Validaciones!A72)","v":"ENTRENAMIENTOS ADMINISTRATIVOS"},{"$f":"+IF(Validaciones!B72=\"\",\"\",Validaciones!B72)","v":"Capacitación para independientes y afiliados sobre los deberes y derechos en el  SGRL y definiciones según normatividad"},{"$f":"+IF(Validaciones!C72=\"\",\"\",Validaciones!C72)","v":"Empresas  e independientes voluntarios - mayor información en:\nAtención al cliente - tel. 3077050 "},{"$f":"+IF(Validaciones!D72=\"\",\"\",Validaciones!D72)","v":"PRESENCIAL "},{"$f":"+IF(Validaciones!E72=\"\",\"\",Validaciones!E72)","v":"BARRANQUILLA"},{"$f":"+IF(Validaciones!F72=\"\",\"\",Validaciones!F72)","v":"2019-05-15"},{"$f":"+IF(Validaciones!G72=\"\",\"\",Validaciones!G72)","v":"8:00 AM - 11:00A M"},{"$f":"+IF(Validaciones!H72=\"\",\"\",Validaciones!H72)","v":"Calle 77 No. 59 - 35 OFC 1403 CENTRO EMPRESARIAL AMERICAS 3"},{"$f":"+IF(Validaciones!I72=\"\",\"\",Validaciones!I72)","v":3},null,{"$f":"+IF(Validaciones!I72=\"\",\"\",Validaciones!I72)","v":3},{"$f":"IF(B78=\"\",\"\",+VLOOKUP(B78,'PRESENCIAL NACIONAL - VIRTUALES'!C:N,12,0))","v":0}]
[{"$f":"+IF(Validaciones!A73=\"\",\"\",Validaciones!A73)","v":"ENTRENAMIENTOS ADMINISTRATIVOS"},{"$f":"+IF(Validaciones!B73=\"\",\"\",Validaciones!B73)","v":"Capacitación para independientes y afiliados sobre los deberes y derechos en el  SGRL y definiciones según normatividad"},{"$f":"+IF(Validaciones!C73=\"\",\"\",Validaciones!C73)","v":"Empresas  e independientes voluntarios - mayor información en:\nAtención al cliente - tel. 3077050 "},{"$f":"+IF(Validaciones!D73=\"\",\"\",Validaciones!D73)","v":"PRESENCIAL "},{"$f":"+IF(Validaciones!E73=\"\",\"\",Validaciones!E73)","v":"BARRANQUILLA"},{"$f":"+IF(Validaciones!F73=\"\",\"\",Validaciones!F73)","v":"2019-06-12"},{"$f":"+IF(Validaciones!G73=\"\",\"\",Validaciones!G73)","v":"8:00 AM - 11:00A M"},{"$f":"+IF(Validaciones!H73=\"\",\"\",Validaciones!H73)","v":"Calle 77 No. 59 - 35 OFC 1403 CENTRO EMPRESARIAL AMERICAS 3"},{"$f":"+IF(Validaciones!I73=\"\",\"\",Validaciones!I73)","v":3},null,{"$f":"+IF(Validaciones!I73=\"\",\"\",Validaciones!I73)","v":3},{"$f":"IF(B79=\"\",\"\",+VLOOKUP(B79,'PRESENCIAL NACIONAL - VIRTUALES'!C:N,12,0))","v":0}]
[{"$f":"+IF(Validaciones!A74=\"\",\"\",Validaciones!A74)","v":"ENTRENAMIENTOS ADMINISTRATIVOS"},{"$f":"+IF(Validaciones!B74=\"\",\"\",Validaciones!B74)","v":"Capacitación para independientes y afiliados sobre los deberes y derechos en el  SGRL y definiciones según normatividad"},{"$f":"+IF(Validaciones!C74=\"\",\"\",Validaciones!C74)","v":"Empresas  e independientes voluntarios - mayor información en:\nAtención al cliente - tel. 3077050 "},{"$f":"+IF(Validaciones!D74=\"\",\"\",Validaciones!D74)","v":"PRESENCIAL "},{"$f":"+IF(Validaciones!E74=\"\",\"\",Validaciones!E74)","v":"BARRANQUILLA"},{"$f":"+IF(Validaciones!F74=\"\",\"\",Validaciones!F74)","v":"2019-07-17"},{"$f":"+IF(Validaciones!G74=\"\",\"\",Validaciones!G74)","v":"8:00 AM - 11:00A M"},{"$f":"+IF(Validaciones!H74=\"\",\"\",Validaciones!H74)","v":"Calle 77 No. 59 - 35 OFC 1403 CENTRO EMPRESARIAL AMERICAS 3"},{"$f":"+IF(Validaciones!I74=\"\",\"\",Validaciones!I74)","v":3},null,{"$f":"+IF(Validaciones!I74=\"\",\"\",Validaciones!I74)","v":3},{"$f":"IF(B80=\"\",\"\",+VLOOKUP(B80,'PRESENCIAL NACIONAL - VIRTUALES'!C:N,12,0))","v":0}]
[{"$f":"+IF(Validaciones!A75=\"\",\"\",Validaciones!A75)","v":"ENTRENAMIENTOS ADMINISTRATIVOS"},{"$f":"+IF(Validaciones!B75=\"\",\"\",Validaciones!B75)","v":"Capacitación para independientes y afiliados sobre los deberes y derechos en el  SGRL y definiciones según normatividad"},{"$f":"+IF(Validaciones!C75=\"\",\"\",Validaciones!C75)","v":"Empresas  e independientes voluntarios - mayor información en:\nAtención al cliente - tel. 3077050 "},{"$f":"+IF(Validaciones!D75=\"\",\"\",Validaciones!D75)","v":"PRESENCIAL "},{"$f":"+IF(Validaciones!E75=\"\",\"\",Validaciones!E75)","v":"BARRANQUILLA"},{"$f":"+IF(Validaciones!F75=\"\",\"\",Validaciones!F75)","v":"2019-08-14"},{"$f":"+IF(Validaciones!G75=\"\",\"\",Validaciones!G75)","v":"8:00 AM - 11:00A M"},{"$f":"+IF(Validaciones!H75=\"\",\"\",Validaciones!H75)","v":"Calle 77 No. 59 - 35 OFC 1403 CENTRO EMPRESARIAL AMERICAS 3"},{"$f":"+IF(Validaciones!I75=\"\",\"\",Validaciones!I75)","v":3},null,{"$f":"+IF(Validaciones!I75=\"\",\"\",Validaciones!I75)","v":3},{"$f":"IF(B81=\"\",\"\",+VLOOKUP(B81,'PRESENCIAL NACIONAL - VIRTUALES'!C:N,12,0))","v":0}]
[{"$f":"+IF(Validaciones!A76=\"\",\"\",Validaciones!A76)","v":"ENTRENAMIENTOS ADMINISTRATIVOS"},{"$f":"+IF(Validaciones!B76=\"\",\"\",Validaciones!B76)","v":"Capacitación para independientes y afiliados sobre los deberes y derechos en el  SGRL y definiciones según normatividad"},{"$f":"+IF(Validaciones!C76=\"\",\"\",Validaciones!C76)","v":"Empresas  e independientes voluntarios - mayor información en:\nAtención al cliente - tel. 3077050 "},{"$f":"+IF(Validaciones!D76=\"\",\"\",Validaciones!D76)","v":"PRESENCIAL "},{"$f":"+IF(Validaciones!E76=\"\",\"\",Validaciones!E76)","v":"BARRANQUILLA"},{"$f":"+IF(Validaciones!F76=\"\",\"\",Validaciones!F76)","v":"2019-09-11"},{"$f":"+IF(Validaciones!G76=\"\",\"\",Validaciones!G76)","v":"8:00 AM - 11:00A M"},{"$f":"+IF(Validaciones!H76=\"\",\"\",Validaciones!H76)","v":"Calle 77 No. 59 - 35 OFC 1403 CENTRO EMPRESARIAL AMERICAS 3"},{"$f":"+IF(Validaciones!I76=\"\",\"\",Validaciones!I76)","v":3},null,{"$f":"+IF(Validaciones!I76=\"\",\"\",Validaciones!I76)","v":3},{"$f":"IF(B82=\"\",\"\",+VLOOKUP(B82,'PRESENCIAL NACIONAL - VIRTUALES'!C:N,12,0))","v":0}]
[{"$f":"+IF(Validaciones!A77=\"\",\"\",Validaciones!A77)","v":"ENTRENAMIENTOS ADMINISTRATIVOS"},{"$f":"+IF(Validaciones!B77=\"\",\"\",Validaciones!B77)","v":"Capacitación para independientes y afiliados sobre los deberes y derechos en el  SGRL y definiciones según normatividad"},{"$f":"+IF(Validaciones!C77=\"\",\"\",Validaciones!C77)","v":"Empresas  e independientes voluntarios - mayor información en:\nAtención al cliente - tel. 3077050 "},{"$f":"+IF(Validaciones!D77=\"\",\"\",Validaciones!D77)","v":"PRESENCIAL "},{"$f":"+IF(Validaciones!E77=\"\",\"\",Validaciones!E77)","v":"BARRANQUILLA"},{"$f":"+IF(Validaciones!F77=\"\",\"\",Validaciones!F77)","v":"2019-10-09"},{"$f":"+IF(Validaciones!G77=\"\",\"\",Validaciones!G77)","v":"8:00 AM - 11:00A M"},{"$f":"+IF(Validaciones!H77=\"\",\"\",Validaciones!H77)","v":"Calle 77 No. 59 - 35 OFC 1403 CENTRO EMPRESARIAL AMERICAS 3"},{"$f":"+IF(Validaciones!I77=\"\",\"\",Validaciones!I77)","v":3},null,{"$f":"+IF(Validaciones!I77=\"\",\"\",Validaciones!I77)","v":3},{"$f":"IF(B83=\"\",\"\",+VLOOKUP(B83,'PRESENCIAL NACIONAL - VIRTUALES'!C:N,12,0))","v":0}]
[{"$f":"+IF(Validaciones!A78=\"\",\"\",Validaciones!A78)","v":"ENTRENAMIENTOS ADMINISTRATIVOS"},{"$f":"+IF(Validaciones!B78=\"\",\"\",Validaciones!B78)","v":"Capacitación para independientes y afiliados sobre los deberes y derechos en el  SGRL y definiciones según normatividad"},{"$f":"+IF(Validaciones!C78=\"\",\"\",Validaciones!C78)","v":"Empresas  e independientes voluntarios - mayor información en:\nAtención al cliente - tel. 3077050 "},{"$f":"+IF(Validaciones!D78=\"\",\"\",Validaciones!D78)","v":"PRESENCIAL "},{"$f":"+IF(Validaciones!E78=\"\",\"\",Validaciones!E78)","v":"BARRANQUILLA"},{"$f":"+IF(Validaciones!F78=\"\",\"\",Validaciones!F78)","v":"2019-12-11"},{"$f":"+IF(Validaciones!G78=\"\",\"\",Validaciones!G78)","v":"8:00 AM - 11:00A M"},{"$f":"+IF(Validaciones!H78=\"\",\"\",Validaciones!H78)","v":"Calle 77 No. 59 - 35 OFC 1403 CENTRO EMPRESARIAL AMERICAS 3"},{"$f":"+IF(Validaciones!I78=\"\",\"\",Validaciones!I78)","v":3},null,{"$f":"+IF(Validaciones!I78=\"\",\"\",Validaciones!I78)","v":3},{"$f":"IF(B84=\"\",\"\",+VLOOKUP(B84,'PRESENCIAL NACIONAL - VIRTUALES'!C:N,12,0))","v":0}]
[{"$f":"+IF(Validaciones!A79=\"\",\"\",Validaciones!A79)","v":"ENTRENAMIENTOS ADMINISTRATIVOS"},{"$f":"+IF(Validaciones!B79=\"\",\"\",Validaciones!B79)","v":"Capacitación para independientes y afiliados sobre los deberes y derechos en el  SGRL y definiciones según normatividad"},{"$f":"+IF(Validaciones!C79=\"\",\"\",Validaciones!C79)","v":"Empresas  e independientes voluntarios - mayor información en:\nAtención al cliente - tel. 3077050 "},{"$f":"+IF(Validaciones!D79=\"\",\"\",Validaciones!D79)","v":"PRESENCIAL "},{"$f":"+IF(Validaciones!E79=\"\",\"\",Validaciones!E79)","v":"BUCARAMANGA"},{"$f":"+IF(Validaciones!F79=\"\",\"\",Validaciones!F79)","v":"2019-01-23"},{"$f":"+IF(Validaciones!G79=\"\",\"\",Validaciones!G79)","v":"8:00 AM - 11:00A M"},{"$f":"+IF(Validaciones!H79=\"\",\"\",Validaciones!H79)","v":"Transv. Oriental No 90-102 Torre Empresarial Cacique Oficinas  703 – 704"},{"$f":"+IF(Validaciones!I79=\"\",\"\",Validaciones!I79)","v":2},null,{"$f":"+IF(Validaciones!I79=\"\",\"\",Validaciones!I79)","v":2},{"$f":"IF(B85=\"\",\"\",+VLOOKUP(B85,'PRESENCIAL NACIONAL - VIRTUALES'!C:N,12,0))","v":0}]
[{"$f":"+IF(Validaciones!A80=\"\",\"\",Validaciones!A80)","v":"ENTRENAMIENTOS ADMINISTRATIVOS"},{"$f":"+IF(Validaciones!B80=\"\",\"\",Validaciones!B80)","v":"Capacitación para independientes y afiliados sobre los deberes y derechos en el  SGRL y definiciones según normatividad"},{"$f":"+IF(Validaciones!C80=\"\",\"\",Validaciones!C80)","v":"Empresas  e independientes voluntarios - mayor información en:\nAtención al cliente - tel. 3077050 "},{"$f":"+IF(Validaciones!D80=\"\",\"\",Validaciones!D80)","v":"PRESENCIAL "},{"$f":"+IF(Validaciones!E80=\"\",\"\",Validaciones!E80)","v":"BUCARAMANGA"},{"$f":"+IF(Validaciones!F80=\"\",\"\",Validaciones!F80)","v":"2019-02-13"},{"$f":"+IF(Validaciones!G80=\"\",\"\",Validaciones!G80)","v":"8:00 AM - 11:00A M"},{"$f":"+IF(Validaciones!H80=\"\",\"\",Validaciones!H80)","v":"Transv. Oriental No 90-102 Torre Empresarial Cacique Oficinas  703 – 704"},{"$f":"+IF(Validaciones!I80=\"\",\"\",Validaciones!I80)","v":2},null,{"$f":"+IF(Validaciones!I80=\"\",\"\",Validaciones!I80)","v":2},{"$f":"IF(B86=\"\",\"\",+VLOOKUP(B86,'PRESENCIAL NACIONAL - VIRTUALES'!C:N,12,0))","v":0}]
[{"$f":"+IF(Validaciones!A81=\"\",\"\",Validaciones!A81)","v":"ENTRENAMIENTOS ADMINISTRATIVOS"},{"$f":"+IF(Validaciones!B81=\"\",\"\",Validaciones!B81)","v":"Capacitación para independientes y afiliados sobre los deberes y derechos en el  SGRL y definiciones según normatividad"},{"$f":"+IF(Validaciones!C81=\"\",\"\",Validaciones!C81)","v":"Empresas  e independientes voluntarios - mayor información en:\nAtención al cliente - tel. 3077050 "},{"$f":"+IF(Validaciones!D81=\"\",\"\",Validaciones!D81)","v":"PRESENCIAL "},{"$f":"+IF(Validaciones!E81=\"\",\"\",Validaciones!E81)","v":"BUCARAMANGA"},{"$f":"+IF(Validaciones!F81=\"\",\"\",Validaciones!F81)","v":"2019-03-13"},{"$f":"+IF(Validaciones!G81=\"\",\"\",Validaciones!G81)","v":"8:00 AM - 11:00A M"},{"$f":"+IF(Validaciones!H81=\"\",\"\",Validaciones!H81)","v":"Transv. Oriental No 90-102 Torre Empresarial Cacique Oficinas  703 – 704"},{"$f":"+IF(Validaciones!I81=\"\",\"\",Validaciones!I81)","v":2},null,{"$f":"+IF(Validaciones!I81=\"\",\"\",Validaciones!I81)","v":2},{"$f":"IF(B87=\"\",\"\",+VLOOKUP(B87,'PRESENCIAL NACIONAL - VIRTUALES'!C:N,12,0))","v":0}]
[{"$f":"+IF(Validaciones!A82=\"\",\"\",Validaciones!A82)","v":"ENTRENAMIENTOS ADMINISTRATIVOS"},{"$f":"+IF(Validaciones!B82=\"\",\"\",Validaciones!B82)","v":"Capacitación para independientes y afiliados sobre los deberes y derechos en el  SGRL y definiciones según normatividad"},{"$f":"+IF(Validaciones!C82=\"\",\"\",Validaciones!C82)","v":"Empresas  e independientes voluntarios - mayor información en:\nAtención al cliente - tel. 3077050 "},{"$f":"+IF(Validaciones!D82=\"\",\"\",Validaciones!D82)","v":"PRESENCIAL "},{"$f":"+IF(Validaciones!E82=\"\",\"\",Validaciones!E82)","v":"BUCARAMANGA"},{"$f":"+IF(Validaciones!F82=\"\",\"\",Validaciones!F82)","v":"2019-04-10"},{"$f":"+IF(Validaciones!G82=\"\",\"\",Validaciones!G82)","v":"8:00 AM - 11:00A M"},{"$f":"+IF(Validaciones!H82=\"\",\"\",Validaciones!H82)","v":"Transv. Oriental No 90-102 Torre Empresarial Cacique Oficinas  703 – 704"},{"$f":"+IF(Validaciones!I82=\"\",\"\",Validaciones!I82)","v":2},null,{"$f":"+IF(Validaciones!I82=\"\",\"\",Validaciones!I82)","v":2},{"$f":"IF(B88=\"\",\"\",+VLOOKUP(B88,'PRESENCIAL NACIONAL - VIRTUALES'!C:N,12,0))","v":0}]
[{"$f":"+IF(Validaciones!A83=\"\",\"\",Validaciones!A83)","v":"ENTRENAMIENTOS ADMINISTRATIVOS"},{"$f":"+IF(Validaciones!B83=\"\",\"\",Validaciones!B83)","v":"Capacitación para independientes y afiliados sobre los deberes y derechos en el  SGRL y definiciones según normatividad"},{"$f":"+IF(Validaciones!C83=\"\",\"\",Validaciones!C83)","v":"Empresas  e independientes voluntarios - mayor información en:\nAtención al cliente - tel. 3077050 "},{"$f":"+IF(Validaciones!D83=\"\",\"\",Validaciones!D83)","v":"PRESENCIAL "},{"$f":"+IF(Validaciones!E83=\"\",\"\",Validaciones!E83)","v":"BUCARAMANGA"},{"$f":"+IF(Validaciones!F83=\"\",\"\",Validaciones!F83)","v":"2019-05-15"},{"$f":"+IF(Validaciones!G83=\"\",\"\",Validaciones!G83)","v":"8:00 AM - 11:00A M"},{"$f":"+IF(Validaciones!H83=\"\",\"\",Validaciones!H83)","v":"Transv. Oriental No 90-102 Torre Empresarial Cacique Oficinas  703 – 704"},{"$f":"+IF(Validaciones!I83=\"\",\"\",Validaciones!I83)","v":2},null,{"$f":"+IF(Validaciones!I83=\"\",\"\",Validaciones!I83)","v":2},{"$f":"IF(B89=\"\",\"\",+VLOOKUP(B89,'PRESENCIAL NACIONAL - VIRTUALES'!C:N,12,0))","v":0}]
[{"$f":"+IF(Validaciones!A84=\"\",\"\",Validaciones!A84)","v":"ENTRENAMIENTOS ADMINISTRATIVOS"},{"$f":"+IF(Validaciones!B84=\"\",\"\",Validaciones!B84)","v":"Capacitación para independientes y afiliados sobre los deberes y derechos en el  SGRL y definiciones según normatividad"},{"$f":"+IF(Validaciones!C84=\"\",\"\",Validaciones!C84)","v":"Empresas  e independientes voluntarios - mayor información en:\nAtención al cliente - tel. 3077050 "},{"$f":"+IF(Validaciones!D84=\"\",\"\",Validaciones!D84)","v":"PRESENCIAL "},{"$f":"+IF(Validaciones!E84=\"\",\"\",Validaciones!E84)","v":"BUCARAMANGA"},{"$f":"+IF(Validaciones!F84=\"\",\"\",Validaciones!F84)","v":"2019-06-12"},{"$f":"+IF(Validaciones!G84=\"\",\"\",Validaciones!G84)","v":"8:00 AM - 11:00A M"},{"$f":"+IF(Validaciones!H84=\"\",\"\",Validaciones!H84)","v":"Transv. Oriental No 90-102 Torre Empresarial Cacique Oficinas  703 – 704"},{"$f":"+IF(Validaciones!I84=\"\",\"\",Validaciones!I84)","v":2},null,{"$f":"+IF(Validaciones!I84=\"\",\"\",Validaciones!I84)","v":2},{"$f":"IF(B90=\"\",\"\",+VLOOKUP(B90,'PRESENCIAL NACIONAL - VIRTUALES'!C:N,12,0))","v":0}]
[{"$f":"+IF(Validaciones!A85=\"\",\"\",Validaciones!A85)","v":"ENTRENAMIENTOS ADMINISTRATIVOS"},{"$f":"+IF(Validaciones!B85=\"\",\"\",Validaciones!B85)","v":"Capacitación para independientes y afiliados sobre los deberes y derechos en el  SGRL y definiciones según normatividad"},{"$f":"+IF(Validaciones!C85=\"\",\"\",Validaciones!C85)","v":"Empresas  e independientes voluntarios - mayor información en:\nAtención al cliente - tel. 3077050 "},{"$f":"+IF(Validaciones!D85=\"\",\"\",Validaciones!D85)","v":"PRESENCIAL "},{"$f":"+IF(Validaciones!E85=\"\",\"\",Validaciones!E85)","v":"BUCARAMANGA"},{"$f":"+IF(Validaciones!F85=\"\",\"\",Validaciones!F85)","v":"2019-07-17"},{"$f":"+IF(Validaciones!G85=\"\",\"\",Validaciones!G85)","v":"8:00 AM - 11:00A M"},{"$f":"+IF(Validaciones!H85=\"\",\"\",Validaciones!H85)","v":"Transv. Oriental No 90-102 Torre Empresarial Cacique Oficinas  703 – 704"},{"$f":"+IF(Validaciones!I85=\"\",\"\",Validaciones!I85)","v":2},null,{"$f":"+IF(Validaciones!I85=\"\",\"\",Validaciones!I85)","v":2},{"$f":"IF(B91=\"\",\"\",+VLOOKUP(B91,'PRESENCIAL NACIONAL - VIRTUALES'!C:N,12,0))","v":0}]
[{"$f":"+IF(Validaciones!A86=\"\",\"\",Validaciones!A86)","v":"ENTRENAMIENTOS ADMINISTRATIVOS"},{"$f":"+IF(Validaciones!B86=\"\",\"\",Validaciones!B86)","v":"Capacitación para independientes y afiliados sobre los deberes y derechos en el  SGRL y definiciones según normatividad"},{"$f":"+IF(Validaciones!C86=\"\",\"\",Validaciones!C86)","v":"Empresas  e independientes voluntarios - mayor información en:\nAtención al cliente - tel. 3077050 "},{"$f":"+IF(Validaciones!D86=\"\",\"\",Validaciones!D86)","v":"PRESENCIAL "},{"$f":"+IF(Validaciones!E86=\"\",\"\",Validaciones!E86)","v":"BUCARAMANGA"},{"$f":"+IF(Validaciones!F86=\"\",\"\",Validaciones!F86)","v":"2019-08-14"},{"$f":"+IF(Validaciones!G86=\"\",\"\",Validaciones!G86)","v":"8:00 AM - 11:00A M"},{"$f":"+IF(Validaciones!H86=\"\",\"\",Validaciones!H86)","v":"Transv. Oriental No 90-102 Torre Empresarial Cacique Oficinas  703 – 704"},{"$f":"+IF(Validaciones!I86=\"\",\"\",Validaciones!I86)","v":2},null,{"$f":"+IF(Validaciones!I86=\"\",\"\",Validaciones!I86)","v":2},{"$f":"IF(B92=\"\",\"\",+VLOOKUP(B92,'PRESENCIAL NACIONAL - VIRTUALES'!C:N,12,0))","v":0}]
[{"$f":"+IF(Validaciones!A87=\"\",\"\",Validaciones!A87)","v":"ENTRENAMIENTOS ADMINISTRATIVOS"},{"$f":"+IF(Validaciones!B87=\"\",\"\",Validaciones!B87)","v":"Capacitación para independientes y afiliados sobre los deberes y derechos en el  SGRL y definiciones según normatividad"},{"$f":"+IF(Validaciones!C87=\"\",\"\",Validaciones!C87)","v":"Empresas  e independientes voluntarios - mayor información en:\nAtención al cliente - tel. 3077050 "},{"$f":"+IF(Validaciones!D87=\"\",\"\",Validaciones!D87)","v":"PRESENCIAL "},{"$f":"+IF(Validaciones!E87=\"\",\"\",Validaciones!E87)","v":"BUCARAMANGA"},{"$f":"+IF(Validaciones!F87=\"\",\"\",Validaciones!F87)","v":"2019-09-11"},{"$f":"+IF(Validaciones!G87=\"\",\"\",Validaciones!G87)","v":"8:00 AM - 11:00A M"},{"$f":"+IF(Validaciones!H87=\"\",\"\",Validaciones!H87)","v":"Transv. Oriental No 90-102 Torre Empresarial Cacique Oficinas  703 – 704"},{"$f":"+IF(Validaciones!I87=\"\",\"\",Validaciones!I87)","v":2},null,{"$f":"+IF(Validaciones!I87=\"\",\"\",Validaciones!I87)","v":2},{"$f":"IF(B93=\"\",\"\",+VLOOKUP(B93,'PRESENCIAL NACIONAL - VIRTUALES'!C:N,12,0))","v":0}]
[{"$f":"+IF(Validaciones!A88=\"\",\"\",Validaciones!A88)","v":"ENTRENAMIENTOS ADMINISTRATIVOS"},{"$f":"+IF(Validaciones!B88=\"\",\"\",Validaciones!B88)","v":"Capacitación para independientes y afiliados sobre los deberes y derechos en el  SGRL y definiciones según normatividad"},{"$f":"+IF(Validaciones!C88=\"\",\"\",Validaciones!C88)","v":"Empresas  e independientes voluntarios - mayor información en:\nAtención al cliente - tel. 3077050 "},{"$f":"+IF(Validaciones!D88=\"\",\"\",Validaciones!D88)","v":"PRESENCIAL "},{"$f":"+IF(Validaciones!E88=\"\",\"\",Validaciones!E88)","v":"BUCARAMANGA"},{"$f":"+IF(Validaciones!F88=\"\",\"\",Validaciones!F88)","v":"2019-10-09"},{"$f":"+IF(Validaciones!G88=\"\",\"\",Validaciones!G88)","v":"8:00 AM - 11:00A M"},{"$f":"+IF(Validaciones!H88=\"\",\"\",Validaciones!H88)","v":"Transv. Oriental No 90-102 Torre Empresarial Cacique Oficinas  703 – 704"},{"$f":"+IF(Validaciones!I88=\"\",\"\",Validaciones!I88)","v":2},null,{"$f":"+IF(Validaciones!I88=\"\",\"\",Validaciones!I88)","v":2},{"$f":"IF(B94=\"\",\"\",+VLOOKUP(B94,'PRESENCIAL NACIONAL - VIRTUALES'!C:N,12,0))","v":0}]
[{"$f":"+IF(Validaciones!A89=\"\",\"\",Validaciones!A89)","v":"ENTRENAMIENTOS ADMINISTRATIVOS"},{"$f":"+IF(Validaciones!B89=\"\",\"\",Validaciones!B89)","v":"Capacitación para independientes y afiliados sobre los deberes y derechos en el  SGRL y definiciones según normatividad"},{"$f":"+IF(Validaciones!C89=\"\",\"\",Validaciones!C89)","v":"Empresas  e independientes voluntarios - mayor información en:\nAtención al cliente - tel. 3077050 "},{"$f":"+IF(Validaciones!D89=\"\",\"\",Validaciones!D89)","v":"PRESENCIAL "},{"$f":"+IF(Validaciones!E89=\"\",\"\",Validaciones!E89)","v":"BUCARAMANGA"},{"$f":"+IF(Validaciones!F89=\"\",\"\",Validaciones!F89)","v":"2019-12-11"},{"$f":"+IF(Validaciones!G89=\"\",\"\",Validaciones!G89)","v":"8:00 AM - 11:00A M"},{"$f":"+IF(Validaciones!H89=\"\",\"\",Validaciones!H89)","v":"Transv. Oriental No 90-102 Torre Empresarial Cacique Oficinas  703 – 704"},{"$f":"+IF(Validaciones!I89=\"\",\"\",Validaciones!I89)","v":2},null,{"$f":"+IF(Validaciones!I89=\"\",\"\",Validaciones!I89)","v":2},{"$f":"IF(B95=\"\",\"\",+VLOOKUP(B95,'PRESENCIAL NACIONAL - VIRTUALES'!C:N,12,0))","v":0}]
[{"$f":"+IF(Validaciones!A90=\"\",\"\",Validaciones!A90)","v":"ENTRENAMIENTOS ADMINISTRATIVOS"},{"$f":"+IF(Validaciones!B90=\"\",\"\",Validaciones!B90)","v":"Capacitación para independientes y afiliados sobre los deberes y derechos en el  SGRL y definiciones según normatividad"},{"$f":"+IF(Validaciones!C90=\"\",\"\",Validaciones!C90)","v":"Empresas  e independientes voluntarios - mayor información en:\nAtención al cliente - tel. 3077050 "},{"$f":"+IF(Validaciones!D90=\"\",\"\",Validaciones!D90)","v":"PRESENCIAL "},{"$f":"+IF(Validaciones!E90=\"\",\"\",Validaciones!E90)","v":"CALI"},{"$f":"+IF(Validaciones!F90=\"\",\"\",Validaciones!F90)","v":"2019-01-23"},{"$f":"+IF(Validaciones!G90=\"\",\"\",Validaciones!G90)","v":"8:00 AM - 11:00A M"},{"$f":"+IF(Validaciones!H90=\"\",\"\",Validaciones!H90)","v":"Cr 36 Norte No. 6A - 65 Piso 23, Oficina 2301"},{"$f":"+IF(Validaciones!I90=\"\",\"\",Validaciones!I90)","v":2},null,{"$f":"+IF(Validaciones!I90=\"\",\"\",Validaciones!I90)","v":2},{"$f":"IF(B96=\"\",\"\",+VLOOKUP(B96,'PRESENCIAL NACIONAL - VIRTUALES'!C:N,12,0))","v":0}]
[{"$f":"+IF(Validaciones!A91=\"\",\"\",Validaciones!A91)","v":"ENTRENAMIENTOS ADMINISTRATIVOS"},{"$f":"+IF(Validaciones!B91=\"\",\"\",Validaciones!B91)","v":"Capacitación para independientes y afiliados sobre los deberes y derechos en el  SGRL y definiciones según normatividad"},{"$f":"+IF(Validaciones!C91=\"\",\"\",Validaciones!C91)","v":"Empresas  e independientes voluntarios - mayor información en:\nAtención al cliente - tel. 3077050 "},{"$f":"+IF(Validaciones!D91=\"\",\"\",Validaciones!D91)","v":"PRESENCIAL "},{"$f":"+IF(Validaciones!E91=\"\",\"\",Validaciones!E91)","v":"CALI"},{"$f":"+IF(Validaciones!F91=\"\",\"\",Validaciones!F91)","v":"2019-02-13"},{"$f":"+IF(Validaciones!G91=\"\",\"\",Validaciones!G91)","v":"8:00 AM - 11:00A M"},{"$f":"+IF(Validaciones!H91=\"\",\"\",Validaciones!H91)","v":"Cr 36 Norte No. 6A - 65 Piso 23, Oficina 2301"},{"$f":"+IF(Validaciones!I91=\"\",\"\",Validaciones!I91)","v":2},null,{"$f":"+IF(Validaciones!I91=\"\",\"\",Validaciones!I91)","v":2},{"$f":"IF(B97=\"\",\"\",+VLOOKUP(B97,'PRESENCIAL NACIONAL - VIRTUALES'!C:N,12,0))","v":0}]
[{"$f":"+IF(Validaciones!A92=\"\",\"\",Validaciones!A92)","v":"ENTRENAMIENTOS ADMINISTRATIVOS"},{"$f":"+IF(Validaciones!B92=\"\",\"\",Validaciones!B92)","v":"Capacitación para independientes y afiliados sobre los deberes y derechos en el  SGRL y definiciones según normatividad"},{"$f":"+IF(Validaciones!C92=\"\",\"\",Validaciones!C92)","v":"Empresas  e independientes voluntarios - mayor información en:\nAtención al cliente - tel. 3077050 "},{"$f":"+IF(Validaciones!D92=\"\",\"\",Validaciones!D92)","v":"PRESENCIAL "},{"$f":"+IF(Validaciones!E92=\"\",\"\",Validaciones!E92)","v":"CALI"},{"$f":"+IF(Validaciones!F92=\"\",\"\",Validaciones!F92)","v":"2019-03-13"},{"$f":"+IF(Validaciones!G92=\"\",\"\",Validaciones!G92)","v":"8:00 AM - 11:00A M"},{"$f":"+IF(Validaciones!H92=\"\",\"\",Validaciones!H92)","v":"Cr 36 Norte No. 6A - 65 Piso 23, Oficina 2301"},{"$f":"+IF(Validaciones!I92=\"\",\"\",Validaciones!I92)","v":2},null,{"$f":"+IF(Validaciones!I92=\"\",\"\",Validaciones!I92)","v":2},{"$f":"IF(B98=\"\",\"\",+VLOOKUP(B98,'PRESENCIAL NACIONAL - VIRTUALES'!C:N,12,0))","v":0}]
[{"$f":"+IF(Validaciones!A93=\"\",\"\",Validaciones!A93)","v":"ENTRENAMIENTOS ADMINISTRATIVOS"},{"$f":"+IF(Validaciones!B93=\"\",\"\",Validaciones!B93)","v":"Capacitación para independientes y afiliados sobre los deberes y derechos en el  SGRL y definiciones según normatividad"},{"$f":"+IF(Validaciones!C93=\"\",\"\",Validaciones!C93)","v":"Empresas  e independientes voluntarios - mayor información en:\nAtención al cliente - tel. 3077050 "},{"$f":"+IF(Validaciones!D93=\"\",\"\",Validaciones!D93)","v":"PRESENCIAL "},{"$f":"+IF(Validaciones!E93=\"\",\"\",Validaciones!E93)","v":"CALI"},{"$f":"+IF(Validaciones!F93=\"\",\"\",Validaciones!F93)","v":"2019-04-10"},{"$f":"+IF(Validaciones!G93=\"\",\"\",Validaciones!G93)","v":"8:00 AM - 11:00A M"},{"$f":"+IF(Validaciones!H93=\"\",\"\",Validaciones!H93)","v":"Cr 36 Norte No. 6A - 65 Piso 23, Oficina 2301"},{"$f":"+IF(Validaciones!I93=\"\",\"\",Validaciones!I93)","v":2},null,{"$f":"+IF(Validaciones!I93=\"\",\"\",Validaciones!I93)","v":2},{"$f":"IF(B99=\"\",\"\",+VLOOKUP(B99,'PRESENCIAL NACIONAL - VIRTUALES'!C:N,12,0))","v":0}]
[{"$f":"+IF(Validaciones!A94=\"\",\"\",Validaciones!A94)","v":"ENTRENAMIENTOS ADMINISTRATIVOS"},{"$f":"+IF(Validaciones!B94=\"\",\"\",Validaciones!B94)","v":"Capacitación para independientes y afiliados sobre los deberes y derechos en el  SGRL y definiciones según normatividad"},{"$f":"+IF(Validaciones!C94=\"\",\"\",Validaciones!C94)","v":"Empresas  e independientes voluntarios - mayor información en:\nAtención al cliente - tel. 3077050 "},{"$f":"+IF(Validaciones!D94=\"\",\"\",Validaciones!D94)","v":"PRESENCIAL "},{"$f":"+IF(Validaciones!E94=\"\",\"\",Validaciones!E94)","v":"CALI"},{"$f":"+IF(Validaciones!F94=\"\",\"\",Validaciones!F94)","v":"2019-05-15"},{"$f":"+IF(Validaciones!G94=\"\",\"\",Validaciones!G94)","v":"8:00 AM - 11:00A M"},{"$f":"+IF(Validaciones!H94=\"\",\"\",Validaciones!H94)","v":"Cr 36 Norte No. 6A - 65 Piso 23, Oficina 2301"},{"$f":"+IF(Validaciones!I94=\"\",\"\",Validaciones!I94)","v":2},null,{"$f":"+IF(Validaciones!I94=\"\",\"\",Validaciones!I94)","v":2},{"$f":"IF(B100=\"\",\"\",+VLOOKUP(B100,'PRESENCIAL NACIONAL - VIRTUALES'!C:N,12,0))","v":0}]
[{"$f":"+IF(Validaciones!A95=\"\",\"\",Validaciones!A95)","v":"ENTRENAMIENTOS ADMINISTRATIVOS"},{"$f":"+IF(Validaciones!B95=\"\",\"\",Validaciones!B95)","v":"Capacitación para independientes y afiliados sobre los deberes y derechos en el  SGRL y definiciones según normatividad"},{"$f":"+IF(Validaciones!C95=\"\",\"\",Validaciones!C95)","v":"Empresas  e independientes voluntarios - mayor información en:\nAtención al cliente - tel. 3077050 "},{"$f":"+IF(Validaciones!D95=\"\",\"\",Validaciones!D95)","v":"PRESENCIAL "},{"$f":"+IF(Validaciones!E95=\"\",\"\",Validaciones!E95)","v":"CALI"},{"$f":"+IF(Validaciones!F95=\"\",\"\",Validaciones!F95)","v":"2019-06-12"},{"$f":"+IF(Validaciones!G95=\"\",\"\",Validaciones!G95)","v":"8:00 AM - 11:00A M"},{"$f":"+IF(Validaciones!H95=\"\",\"\",Validaciones!H95)","v":"Cr 36 Norte No. 6A - 65 Piso 23, Oficina 2301"},{"$f":"+IF(Validaciones!I95=\"\",\"\",Validaciones!I95)","v":2},null,{"$f":"+IF(Validaciones!I95=\"\",\"\",Validaciones!I95)","v":2},{"$f":"IF(B101=\"\",\"\",+VLOOKUP(B101,'PRESENCIAL NACIONAL - VIRTUALES'!C:N,12,0))","v":0}]
[{"$f":"+IF(Validaciones!A96=\"\",\"\",Validaciones!A96)","v":"ENTRENAMIENTOS ADMINISTRATIVOS"},{"$f":"+IF(Validaciones!B96=\"\",\"\",Validaciones!B96)","v":"Capacitación para independientes y afiliados sobre los deberes y derechos en el  SGRL y definiciones según normatividad"},{"$f":"+IF(Validaciones!C96=\"\",\"\",Validaciones!C96)","v":"Empresas  e independientes voluntarios - mayor información en:\nAtención al cliente - tel. 3077050 "},{"$f":"+IF(Validaciones!D96=\"\",\"\",Validaciones!D96)","v":"PRESENCIAL "},{"$f":"+IF(Validaciones!E96=\"\",\"\",Validaciones!E96)","v":"CALI"},{"$f":"+IF(Validaciones!F96=\"\",\"\",Validaciones!F96)","v":"2019-07-17"},{"$f":"+IF(Validaciones!G96=\"\",\"\",Validaciones!G96)","v":"8:00 AM - 11:00A M"},{"$f":"+IF(Validaciones!H96=\"\",\"\",Validaciones!H96)","v":"Cr 36 Norte No. 6A - 65 Piso 23, Oficina 2301"},{"$f":"+IF(Validaciones!I96=\"\",\"\",Validaciones!I96)","v":2},null,{"$f":"+IF(Validaciones!I96=\"\",\"\",Validaciones!I96)","v":2},{"$f":"IF(B102=\"\",\"\",+VLOOKUP(B102,'PRESENCIAL NACIONAL - VIRTUALES'!C:N,12,0))","v":0}]
[{"$f":"+IF(Validaciones!A97=\"\",\"\",Validaciones!A97)","v":"ENTRENAMIENTOS ADMINISTRATIVOS"},{"$f":"+IF(Validaciones!B97=\"\",\"\",Validaciones!B97)","v":"Capacitación para independientes y afiliados sobre los deberes y derechos en el  SGRL y definiciones según normatividad"},{"$f":"+IF(Validaciones!C97=\"\",\"\",Validaciones!C97)","v":"Empresas  e independientes voluntarios - mayor información en:\nAtención al cliente - tel. 3077050 "},{"$f":"+IF(Validaciones!D97=\"\",\"\",Validaciones!D97)","v":"PRESENCIAL "},{"$f":"+IF(Validaciones!E97=\"\",\"\",Validaciones!E97)","v":"CALI"},{"$f":"+IF(Validaciones!F97=\"\",\"\",Validaciones!F97)","v":"2019-08-14"},{"$f":"+IF(Validaciones!G97=\"\",\"\",Validaciones!G97)","v":"8:00 AM - 11:00A M"},{"$f":"+IF(Validaciones!H97=\"\",\"\",Validaciones!H97)","v":"Cr 36 Norte No. 6A - 65 Piso 23, Oficina 2301"},{"$f":"+IF(Validaciones!I97=\"\",\"\",Validaciones!I97)","v":2},null,{"$f":"+IF(Validaciones!I97=\"\",\"\",Validaciones!I97)","v":2},{"$f":"IF(B103=\"\",\"\",+VLOOKUP(B103,'PRESENCIAL NACIONAL - VIRTUALES'!C:N,12,0))","v":0}]
[{"$f":"+IF(Validaciones!A98=\"\",\"\",Validaciones!A98)","v":"ENTRENAMIENTOS ADMINISTRATIVOS"},{"$f":"+IF(Validaciones!B98=\"\",\"\",Validaciones!B98)","v":"Capacitación para independientes y afiliados sobre los deberes y derechos en el  SGRL y definiciones según normatividad"},{"$f":"+IF(Validaciones!C98=\"\",\"\",Validaciones!C98)","v":"Empresas  e independientes voluntarios - mayor información en:\nAtención al cliente - tel. 3077050 "},{"$f":"+IF(Validaciones!D98=\"\",\"\",Validaciones!D98)","v":"PRESENCIAL "},{"$f":"+IF(Validaciones!E98=\"\",\"\",Validaciones!E98)","v":"CALI"},{"$f":"+IF(Validaciones!F98=\"\",\"\",Validaciones!F98)","v":"2019-09-11"},{"$f":"+IF(Validaciones!G98=\"\",\"\",Validaciones!G98)","v":"8:00 AM - 11:00A M"},{"$f":"+IF(Validaciones!H98=\"\",\"\",Validaciones!H98)","v":"Cr 36 Norte No. 6A - 65 Piso 23, Oficina 2301"},{"$f":"+IF(Validaciones!I98=\"\",\"\",Validaciones!I98)","v":2},null,{"$f":"+IF(Validaciones!I98=\"\",\"\",Validaciones!I98)","v":2},{"$f":"IF(B104=\"\",\"\",+VLOOKUP(B104,'PRESENCIAL NACIONAL - VIRTUALES'!C:N,12,0))","v":0}]
[{"$f":"+IF(Validaciones!A99=\"\",\"\",Validaciones!A99)","v":"ENTRENAMIENTOS ADMINISTRATIVOS"},{"$f":"+IF(Validaciones!B99=\"\",\"\",Validaciones!B99)","v":"Capacitación para independientes y afiliados sobre los deberes y derechos en el  SGRL y definiciones según normatividad"},{"$f":"+IF(Validaciones!C99=\"\",\"\",Validaciones!C99)","v":"Empresas  e independientes voluntarios - mayor información en:\nAtención al cliente - tel. 3077050 "},{"$f":"+IF(Validaciones!D99=\"\",\"\",Validaciones!D99)","v":"PRESENCIAL "},{"$f":"+IF(Validaciones!E99=\"\",\"\",Validaciones!E99)","v":"CALI"},{"$f":"+IF(Validaciones!F99=\"\",\"\",Validaciones!F99)","v":"2019-10-09"},{"$f":"+IF(Validaciones!G99=\"\",\"\",Validaciones!G99)","v":"8:00 AM - 11:00A M"},{"$f":"+IF(Validaciones!H99=\"\",\"\",Validaciones!H99)","v":"Cr 36 Norte No. 6A - 65 Piso 23, Oficina 2301"},{"$f":"+IF(Validaciones!I99=\"\",\"\",Validaciones!I99)","v":2},null,{"$f":"+IF(Validaciones!I99=\"\",\"\",Validaciones!I99)","v":2},{"$f":"IF(B105=\"\",\"\",+VLOOKUP(B105,'PRESENCIAL NACIONAL - VIRTUALES'!C:N,12,0))","v":0}]
[{"$f":"+IF(Validaciones!A100=\"\",\"\",Validaciones!A100)","v":"ENTRENAMIENTOS ADMINISTRATIVOS"},{"$f":"+IF(Validaciones!B100=\"\",\"\",Validaciones!B100)","v":"Capacitación para independientes y afiliados sobre los deberes y derechos en el  SGRL y definiciones según normatividad"},{"$f":"+IF(Validaciones!C100=\"\",\"\",Validaciones!C100)","v":"Empresas  e independientes voluntarios - mayor información en:\nAtención al cliente - tel. 3077050 "},{"$f":"+IF(Validaciones!D100=\"\",\"\",Validaciones!D100)","v":"PRESENCIAL "},{"$f":"+IF(Validaciones!E100=\"\",\"\",Validaciones!E100)","v":"CALI"},{"$f":"+IF(Validaciones!F100=\"\",\"\",Validaciones!F100)","v":"2019-12-11"},{"$f":"+IF(Validaciones!G100=\"\",\"\",Validaciones!G100)","v":"8:00 AM - 11:00A M"},{"$f":"+IF(Validaciones!H100=\"\",\"\",Validaciones!H100)","v":"Cr 36 Norte No. 6A - 65 Piso 23, Oficina 2301"},{"$f":"+IF(Validaciones!I100=\"\",\"\",Validaciones!I100)","v":2},null,{"$f":"+IF(Validaciones!I100=\"\",\"\",Validaciones!I100)","v":2},{"$f":"IF(B106=\"\",\"\",+VLOOKUP(B106,'PRESENCIAL NACIONAL - VIRTUALES'!C:N,12,0))","v":0}]
[{"$f":"+IF(Validaciones!A101=\"\",\"\",Validaciones!A101)","v":"ENTRENAMIENTOS ADMINISTRATIVOS"},{"$f":"+IF(Validaciones!B101=\"\",\"\",Validaciones!B101)","v":"Capacitación para independientes y afiliados sobre los deberes y derechos en el  SGRL y definiciones según normatividad"},{"$f":"+IF(Validaciones!C101=\"\",\"\",Validaciones!C101)","v":"Empresas  e independientes voluntarios - mayor información en:\nAtención al cliente - tel. 3077050 "},{"$f":"+IF(Validaciones!D101=\"\",\"\",Validaciones!D101)","v":"PRESENCIAL "},{"$f":"+IF(Validaciones!E101=\"\",\"\",Validaciones!E101)","v":"CARTAGENA"},{"$f":"+IF(Validaciones!F101=\"\",\"\",Validaciones!F101)","v":"2019-01-23"},{"$f":"+IF(Validaciones!G101=\"\",\"\",Validaciones!G101)","v":"8:00 AM - 11:00A M"},{"$f":"+IF(Validaciones!H101=\"\",\"\",Validaciones!H101)","v":"Liberty Seguros, Calle del Arsenal No 8B-195 piso 1"},{"$f":"+IF(Validaciones!I101=\"\",\"\",Validaciones!I101)","v":2},null,{"$f":"+IF(Validaciones!I101=\"\",\"\",Validaciones!I101)","v":2},{"$f":"IF(B107=\"\",\"\",+VLOOKUP(B107,'PRESENCIAL NACIONAL - VIRTUALES'!C:N,12,0))","v":0}]
[{"$f":"+IF(Validaciones!A102=\"\",\"\",Validaciones!A102)","v":"ENTRENAMIENTOS ADMINISTRATIVOS"},{"$f":"+IF(Validaciones!B102=\"\",\"\",Validaciones!B102)","v":"Capacitación para independientes y afiliados sobre los deberes y derechos en el  SGRL y definiciones según normatividad"},{"$f":"+IF(Validaciones!C102=\"\",\"\",Validaciones!C102)","v":"Empresas  e independientes voluntarios - mayor información en:\nAtención al cliente - tel. 3077050 "},{"$f":"+IF(Validaciones!D102=\"\",\"\",Validaciones!D102)","v":"PRESENCIAL "},{"$f":"+IF(Validaciones!E102=\"\",\"\",Validaciones!E102)","v":"CARTAGENA"},{"$f":"+IF(Validaciones!F102=\"\",\"\",Validaciones!F102)","v":"2019-02-13"},{"$f":"+IF(Validaciones!G102=\"\",\"\",Validaciones!G102)","v":"8:00 AM - 11:00A M"},{"$f":"+IF(Validaciones!H102=\"\",\"\",Validaciones!H102)","v":"Liberty Seguros, Calle del Arsenal No 8B-195 piso 1"},{"$f":"+IF(Validaciones!I102=\"\",\"\",Validaciones!I102)","v":2},null,{"$f":"+IF(Validaciones!I102=\"\",\"\",Validaciones!I102)","v":2},{"$f":"IF(B108=\"\",\"\",+VLOOKUP(B108,'PRESENCIAL NACIONAL - VIRTUALES'!C:N,12,0))","v":0}]
[{"$f":"+IF(Validaciones!A103=\"\",\"\",Validaciones!A103)","v":"ENTRENAMIENTOS ADMINISTRATIVOS"},{"$f":"+IF(Validaciones!B103=\"\",\"\",Validaciones!B103)","v":"Capacitación para independientes y afiliados sobre los deberes y derechos en el  SGRL y definiciones según normatividad"},{"$f":"+IF(Validaciones!C103=\"\",\"\",Validaciones!C103)","v":"Empresas  e independientes voluntarios - mayor información en:\nAtención al cliente - tel. 3077050 "},{"$f":"+IF(Validaciones!D103=\"\",\"\",Validaciones!D103)","v":"PRESENCIAL "},{"$f":"+IF(Validaciones!E103=\"\",\"\",Validaciones!E103)","v":"CARTAGENA"},{"$f":"+IF(Validaciones!F103=\"\",\"\",Validaciones!F103)","v":"2019-03-13"},{"$f":"+IF(Validaciones!G103=\"\",\"\",Validaciones!G103)","v":"8:00 AM - 11:00A M"},{"$f":"+IF(Validaciones!H103=\"\",\"\",Validaciones!H103)","v":"Liberty Seguros, Calle del Arsenal No 8B-195 piso 1"},{"$f":"+IF(Validaciones!I103=\"\",\"\",Validaciones!I103)","v":2},null,{"$f":"+IF(Validaciones!I103=\"\",\"\",Validaciones!I103)","v":2},{"$f":"IF(B109=\"\",\"\",+VLOOKUP(B109,'PRESENCIAL NACIONAL - VIRTUALES'!C:N,12,0))","v":0}]
[{"$f":"+IF(Validaciones!A104=\"\",\"\",Validaciones!A104)","v":"ENTRENAMIENTOS ADMINISTRATIVOS"},{"$f":"+IF(Validaciones!B104=\"\",\"\",Validaciones!B104)","v":"Capacitación para independientes y afiliados sobre los deberes y derechos en el  SGRL y definiciones según normatividad"},{"$f":"+IF(Validaciones!C104=\"\",\"\",Validaciones!C104)","v":"Empresas  e independientes voluntarios - mayor información en:\nAtención al cliente - tel. 3077050 "},{"$f":"+IF(Validaciones!D104=\"\",\"\",Validaciones!D104)","v":"PRESENCIAL "},{"$f":"+IF(Validaciones!E104=\"\",\"\",Validaciones!E104)","v":"CARTAGENA"},{"$f":"+IF(Validaciones!F104=\"\",\"\",Validaciones!F104)","v":"2019-04-10"},{"$f":"+IF(Validaciones!G104=\"\",\"\",Validaciones!G104)","v":"8:00 AM - 11:00A M"},{"$f":"+IF(Validaciones!H104=\"\",\"\",Validaciones!H104)","v":"Liberty Seguros, Calle del Arsenal No 8B-195 piso 1"},{"$f":"+IF(Validaciones!I104=\"\",\"\",Validaciones!I104)","v":2},null,{"$f":"+IF(Validaciones!I104=\"\",\"\",Validaciones!I104)","v":2},{"$f":"IF(B110=\"\",\"\",+VLOOKUP(B110,'PRESENCIAL NACIONAL - VIRTUALES'!C:N,12,0))","v":0}]
[{"$f":"+IF(Validaciones!A105=\"\",\"\",Validaciones!A105)","v":"ENTRENAMIENTOS ADMINISTRATIVOS"},{"$f":"+IF(Validaciones!B105=\"\",\"\",Validaciones!B105)","v":"Capacitación para independientes y afiliados sobre los deberes y derechos en el  SGRL y definiciones según normatividad"},{"$f":"+IF(Validaciones!C105=\"\",\"\",Validaciones!C105)","v":"Empresas  e independientes voluntarios - mayor información en:\nAtención al cliente - tel. 3077050 "},{"$f":"+IF(Validaciones!D105=\"\",\"\",Validaciones!D105)","v":"PRESENCIAL "},{"$f":"+IF(Validaciones!E105=\"\",\"\",Validaciones!E105)","v":"CARTAGENA"},{"$f":"+IF(Validaciones!F105=\"\",\"\",Validaciones!F105)","v":"2019-05-15"},{"$f":"+IF(Validaciones!G105=\"\",\"\",Validaciones!G105)","v":"8:00 AM - 11:00A M"},{"$f":"+IF(Validaciones!H105=\"\",\"\",Validaciones!H105)","v":"Liberty Seguros, Calle del Arsenal No 8B-195 piso 1"},{"$f":"+IF(Validaciones!I105=\"\",\"\",Validaciones!I105)","v":2},null,{"$f":"+IF(Validaciones!I105=\"\",\"\",Validaciones!I105)","v":2},{"$f":"IF(B111=\"\",\"\",+VLOOKUP(B111,'PRESENCIAL NACIONAL - VIRTUALES'!C:N,12,0))","v":0}]
[{"$f":"+IF(Validaciones!A106=\"\",\"\",Validaciones!A106)","v":"ENTRENAMIENTOS ADMINISTRATIVOS"},{"$f":"+IF(Validaciones!B106=\"\",\"\",Validaciones!B106)","v":"Capacitación para independientes y afiliados sobre los deberes y derechos en el  SGRL y definiciones según normatividad"},{"$f":"+IF(Validaciones!C106=\"\",\"\",Validaciones!C106)","v":"Empresas  e independientes voluntarios - mayor información en:\nAtención al cliente - tel. 3077050 "},{"$f":"+IF(Validaciones!D106=\"\",\"\",Validaciones!D106)","v":"PRESENCIAL "},{"$f":"+IF(Validaciones!E106=\"\",\"\",Validaciones!E106)","v":"CARTAGENA"},{"$f":"+IF(Validaciones!F106=\"\",\"\",Validaciones!F106)","v":"2019-06-12"},{"$f":"+IF(Validaciones!G106=\"\",\"\",Validaciones!G106)","v":"8:00 AM - 11:00A M"},{"$f":"+IF(Validaciones!H106=\"\",\"\",Validaciones!H106)","v":"Liberty Seguros, Calle del Arsenal No 8B-195 piso 1"},{"$f":"+IF(Validaciones!I106=\"\",\"\",Validaciones!I106)","v":2},null,{"$f":"+IF(Validaciones!I106=\"\",\"\",Validaciones!I106)","v":2},{"$f":"IF(B112=\"\",\"\",+VLOOKUP(B112,'PRESENCIAL NACIONAL - VIRTUALES'!C:N,12,0))","v":0}]
[{"$f":"+IF(Validaciones!A107=\"\",\"\",Validaciones!A107)","v":"ENTRENAMIENTOS ADMINISTRATIVOS"},{"$f":"+IF(Validaciones!B107=\"\",\"\",Validaciones!B107)","v":"Capacitación para independientes y afiliados sobre los deberes y derechos en el  SGRL y definiciones según normatividad"},{"$f":"+IF(Validaciones!C107=\"\",\"\",Validaciones!C107)","v":"Empresas  e independientes voluntarios - mayor información en:\nAtención al cliente - tel. 3077050 "},{"$f":"+IF(Validaciones!D107=\"\",\"\",Validaciones!D107)","v":"PRESENCIAL "},{"$f":"+IF(Validaciones!E107=\"\",\"\",Validaciones!E107)","v":"CARTAGENA"},{"$f":"+IF(Validaciones!F107=\"\",\"\",Validaciones!F107)","v":"2019-07-17"},{"$f":"+IF(Validaciones!G107=\"\",\"\",Validaciones!G107)","v":"8:00 AM - 11:00A M"},{"$f":"+IF(Validaciones!H107=\"\",\"\",Validaciones!H107)","v":"Liberty Seguros, Calle del Arsenal No 8B-195 piso 1"},{"$f":"+IF(Validaciones!I107=\"\",\"\",Validaciones!I107)","v":2},null,{"$f":"+IF(Validaciones!I107=\"\",\"\",Validaciones!I107)","v":2},{"$f":"IF(B113=\"\",\"\",+VLOOKUP(B113,'PRESENCIAL NACIONAL - VIRTUALES'!C:N,12,0))","v":0}]
[{"$f":"+IF(Validaciones!A108=\"\",\"\",Validaciones!A108)","v":"ENTRENAMIENTOS ADMINISTRATIVOS"},{"$f":"+IF(Validaciones!B108=\"\",\"\",Validaciones!B108)","v":"Capacitación para independientes y afiliados sobre los deberes y derechos en el  SGRL y definiciones según normatividad"},{"$f":"+IF(Validaciones!C108=\"\",\"\",Validaciones!C108)","v":"Empresas  e independientes voluntarios - mayor información en:\nAtención al cliente - tel. 3077050 "},{"$f":"+IF(Validaciones!D108=\"\",\"\",Validaciones!D108)","v":"PRESENCIAL "},{"$f":"+IF(Validaciones!E108=\"\",\"\",Validaciones!E108)","v":"CARTAGENA"},{"$f":"+IF(Validaciones!F108=\"\",\"\",Validaciones!F108)","v":"2019-08-14"},{"$f":"+IF(Validaciones!G108=\"\",\"\",Validaciones!G108)","v":"8:00 AM - 11:00A M"},{"$f":"+IF(Validaciones!H108=\"\",\"\",Validaciones!H108)","v":"Liberty Seguros, Calle del Arsenal No 8B-195 piso 1"},{"$f":"+IF(Validaciones!I108=\"\",\"\",Validaciones!I108)","v":2},null,{"$f":"+IF(Validaciones!I108=\"\",\"\",Validaciones!I108)","v":2},{"$f":"IF(B114=\"\",\"\",+VLOOKUP(B114,'PRESENCIAL NACIONAL - VIRTUALES'!C:N,12,0))","v":0}]
[{"$f":"+IF(Validaciones!A109=\"\",\"\",Validaciones!A109)","v":"ENTRENAMIENTOS ADMINISTRATIVOS"},{"$f":"+IF(Validaciones!B109=\"\",\"\",Validaciones!B109)","v":"Capacitación para independientes y afiliados sobre los deberes y derechos en el  SGRL y definiciones según normatividad"},{"$f":"+IF(Validaciones!C109=\"\",\"\",Validaciones!C109)","v":"Empresas  e independientes voluntarios - mayor información en:\nAtención al cliente - tel. 3077050 "},{"$f":"+IF(Validaciones!D109=\"\",\"\",Validaciones!D109)","v":"PRESENCIAL "},{"$f":"+IF(Validaciones!E109=\"\",\"\",Validaciones!E109)","v":"CARTAGENA"},{"$f":"+IF(Validaciones!F109=\"\",\"\",Validaciones!F109)","v":"2019-09-11"},{"$f":"+IF(Validaciones!G109=\"\",\"\",Validaciones!G109)","v":"8:00 AM - 11:00A M"},{"$f":"+IF(Validaciones!H109=\"\",\"\",Validaciones!H109)","v":"Liberty Seguros, Calle del Arsenal No 8B-195 piso 1"},{"$f":"+IF(Validaciones!I109=\"\",\"\",Validaciones!I109)","v":2},null,{"$f":"+IF(Validaciones!I109=\"\",\"\",Validaciones!I109)","v":2},{"$f":"IF(B115=\"\",\"\",+VLOOKUP(B115,'PRESENCIAL NACIONAL - VIRTUALES'!C:N,12,0))","v":0}]
[{"$f":"+IF(Validaciones!A110=\"\",\"\",Validaciones!A110)","v":"ENTRENAMIENTOS ADMINISTRATIVOS"},{"$f":"+IF(Validaciones!B110=\"\",\"\",Validaciones!B110)","v":"Capacitación para independientes y afiliados sobre los deberes y derechos en el  SGRL y definiciones según normatividad"},{"$f":"+IF(Validaciones!C110=\"\",\"\",Validaciones!C110)","v":"Empresas  e independientes voluntarios - mayor información en:\nAtención al cliente - tel. 3077050 "},{"$f":"+IF(Validaciones!D110=\"\",\"\",Validaciones!D110)","v":"PRESENCIAL "},{"$f":"+IF(Validaciones!E110=\"\",\"\",Validaciones!E110)","v":"CARTAGENA"},{"$f":"+IF(Validaciones!F110=\"\",\"\",Validaciones!F110)","v":"2019-10-09"},{"$f":"+IF(Validaciones!G110=\"\",\"\",Validaciones!G110)","v":"8:00 AM - 11:00A M"},{"$f":"+IF(Validaciones!H110=\"\",\"\",Validaciones!H110)","v":"Liberty Seguros, Calle del Arsenal No 8B-195 piso 1"},{"$f":"+IF(Validaciones!I110=\"\",\"\",Validaciones!I110)","v":2},null,{"$f":"+IF(Validaciones!I110=\"\",\"\",Validaciones!I110)","v":2},{"$f":"IF(B116=\"\",\"\",+VLOOKUP(B116,'PRESENCIAL NACIONAL - VIRTUALES'!C:N,12,0))","v":0}]
[{"$f":"+IF(Validaciones!A111=\"\",\"\",Validaciones!A111)","v":"ENTRENAMIENTOS ADMINISTRATIVOS"},{"$f":"+IF(Validaciones!B111=\"\",\"\",Validaciones!B111)","v":"Capacitación para independientes y afiliados sobre los deberes y derechos en el  SGRL y definiciones según normatividad"},{"$f":"+IF(Validaciones!C111=\"\",\"\",Validaciones!C111)","v":"Empresas  e independientes voluntarios - mayor información en:\nAtención al cliente - tel. 3077050 "},{"$f":"+IF(Validaciones!D111=\"\",\"\",Validaciones!D111)","v":"PRESENCIAL "},{"$f":"+IF(Validaciones!E111=\"\",\"\",Validaciones!E111)","v":"CARTAGENA"},{"$f":"+IF(Validaciones!F111=\"\",\"\",Validaciones!F111)","v":"2019-12-11"},{"$f":"+IF(Validaciones!G111=\"\",\"\",Validaciones!G111)","v":"8:00 AM - 11:00A M"},{"$f":"+IF(Validaciones!H111=\"\",\"\",Validaciones!H111)","v":"Liberty Seguros, Calle del Arsenal No 8B-195 piso 1"},{"$f":"+IF(Validaciones!I111=\"\",\"\",Validaciones!I111)","v":2},null,{"$f":"+IF(Validaciones!I111=\"\",\"\",Validaciones!I111)","v":2},{"$f":"IF(B117=\"\",\"\",+VLOOKUP(B117,'PRESENCIAL NACIONAL - VIRTUALES'!C:N,12,0))","v":0}]
[{"$f":"+IF(Validaciones!A112=\"\",\"\",Validaciones!A112)","v":"ENTRENAMIENTOS ADMINISTRATIVOS"},{"$f":"+IF(Validaciones!B112=\"\",\"\",Validaciones!B112)","v":"Capacitación para independientes y afiliados sobre los deberes y derechos en el  SGRL y definiciones según normatividad"},{"$f":"+IF(Validaciones!C112=\"\",\"\",Validaciones!C112)","v":"Empresas  e independientes voluntarios - mayor información en:\nAtención al cliente - tel. 3077050 "},{"$f":"+IF(Validaciones!D112=\"\",\"\",Validaciones!D112)","v":"PRESENCIAL "},{"$f":"+IF(Validaciones!E112=\"\",\"\",Validaciones!E112)","v":"BOGOTÁ"},{"$f":"+IF(Validaciones!F112=\"\",\"\",Validaciones!F112)","v":"2019-01-23"},{"$f":"+IF(Validaciones!G112=\"\",\"\",Validaciones!G112)","v":"8:00 AM - 11:00A M"},{"$f":"+IF(Validaciones!H112=\"\",\"\",Validaciones!H112)","v":"Calle 72 N. 10 - 07 "},{"$f":"+IF(Validaciones!I112=\"\",\"\",Validaciones!I112)","v":2},null,{"$f":"+IF(Validaciones!I112=\"\",\"\",Validaciones!I112)","v":2},{"$f":"IF(B118=\"\",\"\",+VLOOKUP(B118,'PRESENCIAL NACIONAL - VIRTUALES'!C:N,12,0))","v":0}]
[{"$f":"+IF(Validaciones!A113=\"\",\"\",Validaciones!A113)","v":"ENTRENAMIENTOS ADMINISTRATIVOS"},{"$f":"+IF(Validaciones!B113=\"\",\"\",Validaciones!B113)","v":"Capacitación para independientes y afiliados sobre los deberes y derechos en el  SGRL y definiciones según normatividad"},{"$f":"+IF(Validaciones!C113=\"\",\"\",Validaciones!C113)","v":"Empresas  e independientes voluntarios - mayor información en:\nAtención al cliente - tel. 3077050 "},{"$f":"+IF(Validaciones!D113=\"\",\"\",Validaciones!D113)","v":"PRESENCIAL "},{"$f":"+IF(Validaciones!E113=\"\",\"\",Validaciones!E113)","v":"BOGOTÁ"},{"$f":"+IF(Validaciones!F113=\"\",\"\",Validaciones!F113)","v":"2019-02-13"},{"$f":"+IF(Validaciones!G113=\"\",\"\",Validaciones!G113)","v":"8:00 AM - 11:00A M"},{"$f":"+IF(Validaciones!H113=\"\",\"\",Validaciones!H113)","v":"Calle 73 N° 10 - 83 Torre C Oficina 302. Salón 302 Fucsia"},{"$f":"+IF(Validaciones!I113=\"\",\"\",Validaciones!I113)","v":2},null,{"$f":"+IF(Validaciones!I113=\"\",\"\",Validaciones!I113)","v":2},{"$f":"IF(B119=\"\",\"\",+VLOOKUP(B119,'PRESENCIAL NACIONAL - VIRTUALES'!C:N,12,0))","v":0}]
[{"$f":"+IF(Validaciones!A114=\"\",\"\",Validaciones!A114)","v":"ENTRENAMIENTOS ADMINISTRATIVOS"},{"$f":"+IF(Validaciones!B114=\"\",\"\",Validaciones!B114)","v":"Capacitación para independientes y afiliados sobre los deberes y derechos en el  SGRL y definiciones según normatividad"},{"$f":"+IF(Validaciones!C114=\"\",\"\",Validaciones!C114)","v":"Empresas  e independientes voluntarios - mayor información en:\nAtención al cliente - tel. 3077050 "},{"$f":"+IF(Validaciones!D114=\"\",\"\",Validaciones!D114)","v":"PRESENCIAL "},{"$f":"+IF(Validaciones!E114=\"\",\"\",Validaciones!E114)","v":"BOGOTÁ"},{"$f":"+IF(Validaciones!F114=\"\",\"\",Validaciones!F114)","v":"2019-03-13"},{"$f":"+IF(Validaciones!G114=\"\",\"\",Validaciones!G114)","v":"8:00 AM - 11:00A M"},{"$f":"+IF(Validaciones!H114=\"\",\"\",Validaciones!H114)","v":"Calle 73 N° 10 - 83 Torre C Oficina 302. Salón 302 Fucsia"},{"$f":"+IF(Validaciones!I114=\"\",\"\",Validaciones!I114)","v":2},null,{"$f":"+IF(Validaciones!I114=\"\",\"\",Validaciones!I114)","v":2},{"$f":"IF(B120=\"\",\"\",+VLOOKUP(B120,'PRESENCIAL NACIONAL - VIRTUALES'!C:N,12,0))","v":0}]
[{"$f":"+IF(Validaciones!A115=\"\",\"\",Validaciones!A115)","v":"ENTRENAMIENTOS ADMINISTRATIVOS"},{"$f":"+IF(Validaciones!B115=\"\",\"\",Validaciones!B115)","v":"Capacitación para independientes y afiliados sobre los deberes y derechos en el  SGRL y definiciones según normatividad"},{"$f":"+IF(Validaciones!C115=\"\",\"\",Validaciones!C115)","v":"Empresas  e independientes voluntarios - mayor información en:\nAtención al cliente - tel. 3077050 "},{"$f":"+IF(Validaciones!D115=\"\",\"\",Validaciones!D115)","v":"PRESENCIAL "},{"$f":"+IF(Validaciones!E115=\"\",\"\",Validaciones!E115)","v":"BOGOTÁ"},{"$f":"+IF(Validaciones!F115=\"\",\"\",Validaciones!F115)","v":"2019-04-10"},{"$f":"+IF(Validaciones!G115=\"\",\"\",Validaciones!G115)","v":"8:00 AM - 11:00A M"},{"$f":"+IF(Validaciones!H115=\"\",\"\",Validaciones!H115)","v":"Calle 73 N° 10 - 83 Torre C Oficina 302. Salón 302 Fucsia"},{"$f":"+IF(Validaciones!I115=\"\",\"\",Validaciones!I115)","v":2},null,{"$f":"+IF(Validaciones!I115=\"\",\"\",Validaciones!I115)","v":2},{"$f":"IF(B121=\"\",\"\",+VLOOKUP(B121,'PRESENCIAL NACIONAL - VIRTUALES'!C:N,12,0))","v":0}]
[{"$f":"+IF(Validaciones!A116=\"\",\"\",Validaciones!A116)","v":"ENTRENAMIENTOS ADMINISTRATIVOS"},{"$f":"+IF(Validaciones!B116=\"\",\"\",Validaciones!B116)","v":"Capacitación para independientes y afiliados sobre los deberes y derechos en el  SGRL y definiciones según normatividad"},{"$f":"+IF(Validaciones!C116=\"\",\"\",Validaciones!C116)","v":"Empresas  e independientes voluntarios - mayor información en:\nAtención al cliente - tel. 3077050 "},{"$f":"+IF(Validaciones!D116=\"\",\"\",Validaciones!D116)","v":"PRESENCIAL "},{"$f":"+IF(Validaciones!E116=\"\",\"\",Validaciones!E116)","v":"BOGOTÁ"},{"$f":"+IF(Validaciones!F116=\"\",\"\",Validaciones!F116)","v":"2019-05-15"},{"$f":"+IF(Validaciones!G116=\"\",\"\",Validaciones!G116)","v":"8:00 AM - 11:00A M"},{"$f":"+IF(Validaciones!H116=\"\",\"\",Validaciones!H116)","v":"Calle 73 N° 10 - 83 Torre C Oficina 302. Salón 302 Fucsia"},{"$f":"+IF(Validaciones!I116=\"\",\"\",Validaciones!I116)","v":2},null,{"$f":"+IF(Validaciones!I116=\"\",\"\",Validaciones!I116)","v":2},{"$f":"IF(B122=\"\",\"\",+VLOOKUP(B122,'PRESENCIAL NACIONAL - VIRTUALES'!C:N,12,0))","v":0}]
[{"$f":"+IF(Validaciones!A117=\"\",\"\",Validaciones!A117)","v":"ENTRENAMIENTOS ADMINISTRATIVOS"},{"$f":"+IF(Validaciones!B117=\"\",\"\",Validaciones!B117)","v":"Capacitación para independientes y afiliados sobre los deberes y derechos en el  SGRL y definiciones según normatividad"},{"$f":"+IF(Validaciones!C117=\"\",\"\",Validaciones!C117)","v":"Empresas  e independientes voluntarios - mayor información en:\nAtención al cliente - tel. 3077050 "},{"$f":"+IF(Validaciones!D117=\"\",\"\",Validaciones!D117)","v":"PRESENCIAL "},{"$f":"+IF(Validaciones!E117=\"\",\"\",Validaciones!E117)","v":"BOGOTÁ"},{"$f":"+IF(Validaciones!F117=\"\",\"\",Validaciones!F117)","v":"2019-06-12"},{"$f":"+IF(Validaciones!G117=\"\",\"\",Validaciones!G117)","v":"8:00 AM - 11:00A M"},{"$f":"+IF(Validaciones!H117=\"\",\"\",Validaciones!H117)","v":"Calle 73 N° 10 - 83 Torre C Oficina 302. Salón 302 Fucsia"},{"$f":"+IF(Validaciones!I117=\"\",\"\",Validaciones!I117)","v":2},null,{"$f":"+IF(Validaciones!I117=\"\",\"\",Validaciones!I117)","v":2},{"$f":"IF(B123=\"\",\"\",+VLOOKUP(B123,'PRESENCIAL NACIONAL - VIRTUALES'!C:N,12,0))","v":0}]
[{"$f":"+IF(Validaciones!A118=\"\",\"\",Validaciones!A118)","v":"ENTRENAMIENTOS ADMINISTRATIVOS"},{"$f":"+IF(Validaciones!B118=\"\",\"\",Validaciones!B118)","v":"Capacitación para independientes y afiliados sobre los deberes y derechos en el  SGRL y definiciones según normatividad"},{"$f":"+IF(Validaciones!C118=\"\",\"\",Validaciones!C118)","v":"Empresas  e independientes voluntarios - mayor información en:\nAtención al cliente - tel. 3077050 "},{"$f":"+IF(Validaciones!D118=\"\",\"\",Validaciones!D118)","v":"PRESENCIAL "},{"$f":"+IF(Validaciones!E118=\"\",\"\",Validaciones!E118)","v":"BOGOTÁ"},{"$f":"+IF(Validaciones!F118=\"\",\"\",Validaciones!F118)","v":"2019-07-17"},{"$f":"+IF(Validaciones!G118=\"\",\"\",Validaciones!G118)","v":"8:00 AM - 11:00A M"},{"$f":"+IF(Validaciones!H118=\"\",\"\",Validaciones!H118)","v":"Calle 73 N° 10 - 83 Torre C Oficina 302. Salón 302 Fucsia"},{"$f":"+IF(Validaciones!I118=\"\",\"\",Validaciones!I118)","v":2},null,{"$f":"+IF(Validaciones!I118=\"\",\"\",Validaciones!I118)","v":2},{"$f":"IF(B124=\"\",\"\",+VLOOKUP(B124,'PRESENCIAL NACIONAL - VIRTUALES'!C:N,12,0))","v":0}]
[{"$f":"+IF(Validaciones!A119=\"\",\"\",Validaciones!A119)","v":"ENTRENAMIENTOS ADMINISTRATIVOS"},{"$f":"+IF(Validaciones!B119=\"\",\"\",Validaciones!B119)","v":"Capacitación para independientes y afiliados sobre los deberes y derechos en el  SGRL y definiciones según normatividad"},{"$f":"+IF(Validaciones!C119=\"\",\"\",Validaciones!C119)","v":"Empresas  e independientes voluntarios - mayor información en:\nAtención al cliente - tel. 3077050 "},{"$f":"+IF(Validaciones!D119=\"\",\"\",Validaciones!D119)","v":"PRESENCIAL "},{"$f":"+IF(Validaciones!E119=\"\",\"\",Validaciones!E119)","v":"BOGOTÁ"},{"$f":"+IF(Validaciones!F119=\"\",\"\",Validaciones!F119)","v":"2019-08-14"},{"$f":"+IF(Validaciones!G119=\"\",\"\",Validaciones!G119)","v":"8:00 AM - 11:00A M"},{"$f":"+IF(Validaciones!H119=\"\",\"\",Validaciones!H119)","v":"Calle 73 N° 10 - 83 Torre C Oficina 302. Salón 302 Fucsia"},{"$f":"+IF(Validaciones!I119=\"\",\"\",Validaciones!I119)","v":2},null,{"$f":"+IF(Validaciones!I119=\"\",\"\",Validaciones!I119)","v":2},{"$f":"IF(B125=\"\",\"\",+VLOOKUP(B125,'PRESENCIAL NACIONAL - VIRTUALES'!C:N,12,0))","v":0}]
[{"$f":"+IF(Validaciones!A120=\"\",\"\",Validaciones!A120)","v":"ENTRENAMIENTOS ADMINISTRATIVOS"},{"$f":"+IF(Validaciones!B120=\"\",\"\",Validaciones!B120)","v":"Capacitación para independientes y afiliados sobre los deberes y derechos en el  SGRL y definiciones según normatividad"},{"$f":"+IF(Validaciones!C120=\"\",\"\",Validaciones!C120)","v":"Empresas  e independientes voluntarios - mayor información en:\nAtención al cliente - tel. 3077050 "},{"$f":"+IF(Validaciones!D120=\"\",\"\",Validaciones!D120)","v":"PRESENCIAL "},{"$f":"+IF(Validaciones!E120=\"\",\"\",Validaciones!E120)","v":"BOGOTÁ"},{"$f":"+IF(Validaciones!F120=\"\",\"\",Validaciones!F120)","v":"2019-09-11"},{"$f":"+IF(Validaciones!G120=\"\",\"\",Validaciones!G120)","v":"8:00 AM - 11:00A M"},{"$f":"+IF(Validaciones!H120=\"\",\"\",Validaciones!H120)","v":"Calle 73 N° 10 - 83 Torre C Oficina 302. Salón 302 Fucsia"},{"$f":"+IF(Validaciones!I120=\"\",\"\",Validaciones!I120)","v":2},null,{"$f":"+IF(Validaciones!I122=\"\",\"\",Validaciones!I122)","v":2},{"$f":"IF(B126=\"\",\"\",+VLOOKUP(B126,'PRESENCIAL NACIONAL - VIRTUALES'!C:N,12,0))","v":0}]
[{"$f":"+IF(Validaciones!A121=\"\",\"\",Validaciones!A121)","v":"ENTRENAMIENTOS ADMINISTRATIVOS"},{"$f":"+IF(Validaciones!B121=\"\",\"\",Validaciones!B121)","v":"Capacitación para independientes y afiliados sobre los deberes y derechos en el  SGRL y definiciones según normatividad"},{"$f":"+IF(Validaciones!C121=\"\",\"\",Validaciones!C121)","v":"Empresas  e independientes voluntarios - mayor información en:\nAtención al cliente - tel. 3077050 "},{"$f":"+IF(Validaciones!D121=\"\",\"\",Validaciones!D121)","v":"PRESENCIAL "},{"$f":"+IF(Validaciones!E121=\"\",\"\",Validaciones!E121)","v":"BOGOTÁ"},{"$f":"+IF(Validaciones!F121=\"\",\"\",Validaciones!F121)","v":"2019-10-09"},{"$f":"+IF(Validaciones!G121=\"\",\"\",Validaciones!G121)","v":"8:00 AM - 11:00A M"},{"$f":"+IF(Validaciones!H121=\"\",\"\",Validaciones!H121)","v":"Calle 73 N° 10 - 83 Torre C Oficina 302. Salón 302 Fucsia"},{"$f":"+IF(Validaciones!I121=\"\",\"\",Validaciones!I121)","v":2},null,{"$f":"+IF(Validaciones!I123=\"\",\"\",Validaciones!I123)","v":2},{"$f":"IF(B127=\"\",\"\",+VLOOKUP(B127,'PRESENCIAL NACIONAL - VIRTUALES'!C:N,12,0))","v":0}]
[{"$f":"+IF(Validaciones!A122=\"\",\"\",Validaciones!A122)","v":"ENTRENAMIENTOS ADMINISTRATIVOS"},{"$f":"+IF(Validaciones!B122=\"\",\"\",Validaciones!B122)","v":"Capacitación para independientes y afiliados sobre los deberes y derechos en el  SGRL y definiciones según normatividad"},{"$f":"+IF(Validaciones!C122=\"\",\"\",Validaciones!C122)","v":"Empresas  e independientes voluntarios - mayor información en:\nAtención al cliente - tel. 3077050 "},{"$f":"+IF(Validaciones!D122=\"\",\"\",Validaciones!D122)","v":"PRESENCIAL "},{"$f":"+IF(Validaciones!E122=\"\",\"\",Validaciones!E122)","v":"BOGOTÁ"},{"$f":"+IF(Validaciones!F122=\"\",\"\",Validaciones!F122)","v":"2019-12-11"},{"$f":"+IF(Validaciones!G122=\"\",\"\",Validaciones!G122)","v":"8:00 AM - 11:00A M"},{"$f":"+IF(Validaciones!H122=\"\",\"\",Validaciones!H122)","v":"Calle 73 N° 10 - 83 Torre C Oficina 302. Salón 302 Fucsia"},{"$f":"+IF(Validaciones!I122=\"\",\"\",Validaciones!I122)","v":2},null,{"$f":"+IF(Validaciones!I124=\"\",\"\",Validaciones!I124)","v":2},{"$f":"IF(B128=\"\",\"\",+VLOOKUP(B128,'PRESENCIAL NACIONAL - VIRTUALES'!C:N,12,0))","v":0}]
[{"$f":"+IF(Validaciones!A123=\"\",\"\",Validaciones!A123)","v":"ENTRENAMIENTOS ADMINISTRATIVOS"},{"$f":"+IF(Validaciones!B123=\"\",\"\",Validaciones!B123)","v":"Capacitación para independientes y afiliados sobre los deberes y derechos en el  SGRL y definiciones según normatividad"},{"$f":"+IF(Validaciones!C123=\"\",\"\",Validaciones!C123)","v":"Empresas  e independientes voluntarios - mayor información en:\nAtención al cliente - tel. 3077050 "},{"$f":"+IF(Validaciones!D123=\"\",\"\",Validaciones!D123)","v":"PRESENCIAL "},{"$f":"+IF(Validaciones!E123=\"\",\"\",Validaciones!E123)","v":"MEDELLÍN "},{"$f":"+IF(Validaciones!F123=\"\",\"\",Validaciones!F123)","v":"2019-01-23"},{"$f":"+IF(Validaciones!G123=\"\",\"\",Validaciones!G123)","v":"8:00 AM - 11:00A M"},{"$f":"+IF(Validaciones!H123=\"\",\"\",Validaciones!H123)","v":"Cra 43A No. 19-17, Piso 15"},{"$f":"+IF(Validaciones!I123=\"\",\"\",Validaciones!I123)","v":2},null,{"$f":"+IF(Validaciones!I125=\"\",\"\",Validaciones!I125)","v":2},{"$f":"IF(B129=\"\",\"\",+VLOOKUP(B129,'PRESENCIAL NACIONAL - VIRTUALES'!C:N,12,0))","v":0}]
[{"$f":"+IF(Validaciones!A124=\"\",\"\",Validaciones!A124)","v":"ENTRENAMIENTOS ADMINISTRATIVOS"},{"$f":"+IF(Validaciones!B124=\"\",\"\",Validaciones!B124)","v":"Capacitación para independientes y afiliados sobre los deberes y derechos en el  SGRL y definiciones según normatividad"},{"$f":"+IF(Validaciones!C124=\"\",\"\",Validaciones!C124)","v":"Empresas  e independientes voluntarios - mayor información en:\nAtención al cliente - tel. 3077050 "},{"$f":"+IF(Validaciones!D124=\"\",\"\",Validaciones!D124)","v":"PRESENCIAL "},{"$f":"+IF(Validaciones!E124=\"\",\"\",Validaciones!E124)","v":"MEDELLÍN "},{"$f":"+IF(Validaciones!F124=\"\",\"\",Validaciones!F124)","v":"2019-02-13"},{"$f":"+IF(Validaciones!G124=\"\",\"\",Validaciones!G124)","v":"8:00 AM - 11:00A M"},{"$f":"+IF(Validaciones!H124=\"\",\"\",Validaciones!H124)","v":"Cra 43A No. 19-17, Piso 15"},{"$f":"+IF(Validaciones!I124=\"\",\"\",Validaciones!I124)","v":2},null,{"$f":"+IF(Validaciones!I126=\"\",\"\",Validaciones!I126)","v":2},{"$f":"IF(B130=\"\",\"\",+VLOOKUP(B130,'PRESENCIAL NACIONAL - VIRTUALES'!C:N,12,0))","v":0}]
[{"$f":"+IF(Validaciones!A125=\"\",\"\",Validaciones!A125)","v":"ENTRENAMIENTOS ADMINISTRATIVOS"},{"$f":"+IF(Validaciones!B125=\"\",\"\",Validaciones!B125)","v":"Capacitación para independientes y afiliados sobre los deberes y derechos en el  SGRL y definiciones según normatividad"},{"$f":"+IF(Validaciones!C125=\"\",\"\",Validaciones!C125)","v":"Empresas  e independientes voluntarios - mayor información en:\nAtención al cliente - tel. 3077050 "},{"$f":"+IF(Validaciones!D125=\"\",\"\",Validaciones!D125)","v":"PRESENCIAL "},{"$f":"+IF(Validaciones!E125=\"\",\"\",Validaciones!E125)","v":"MEDELLÍN "},{"$f":"+IF(Validaciones!F125=\"\",\"\",Validaciones!F125)","v":"2019-03-13"},{"$f":"+IF(Validaciones!G125=\"\",\"\",Validaciones!G125)","v":"8:00 AM - 11:00A M"},{"$f":"+IF(Validaciones!H125=\"\",\"\",Validaciones!H125)","v":"Cra 43A No. 19-17, Piso 15"},{"$f":"+IF(Validaciones!I125=\"\",\"\",Validaciones!I125)","v":2},null,{"$f":"+IF(Validaciones!I127=\"\",\"\",Validaciones!I127)","v":2},{"$f":"IF(B131=\"\",\"\",+VLOOKUP(B131,'PRESENCIAL NACIONAL - VIRTUALES'!C:N,12,0))","v":0}]
[{"$f":"+IF(Validaciones!A126=\"\",\"\",Validaciones!A126)","v":"ENTRENAMIENTOS ADMINISTRATIVOS"},{"$f":"+IF(Validaciones!B126=\"\",\"\",Validaciones!B126)","v":"Capacitación para independientes y afiliados sobre los deberes y derechos en el  SGRL y definiciones según normatividad"},{"$f":"+IF(Validaciones!C126=\"\",\"\",Validaciones!C126)","v":"Empresas  e independientes voluntarios - mayor información en:\nAtención al cliente - tel. 3077050 "},{"$f":"+IF(Validaciones!D126=\"\",\"\",Validaciones!D126)","v":"PRESENCIAL "},{"$f":"+IF(Validaciones!E126=\"\",\"\",Validaciones!E126)","v":"MEDELLÍN "},{"$f":"+IF(Validaciones!F126=\"\",\"\",Validaciones!F126)","v":"2019-04-10"},{"$f":"+IF(Validaciones!G126=\"\",\"\",Validaciones!G126)","v":"8:00 AM - 11:00A M"},{"$f":"+IF(Validaciones!H126=\"\",\"\",Validaciones!H126)","v":"Cra 43A No. 19-17, Piso 15"},{"$f":"+IF(Validaciones!I126=\"\",\"\",Validaciones!I126)","v":2},null,{"$f":"+IF(Validaciones!I128=\"\",\"\",Validaciones!I128)","v":2},{"$f":"IF(B132=\"\",\"\",+VLOOKUP(B132,'PRESENCIAL NACIONAL - VIRTUALES'!C:N,12,0))","v":0}]
[{"$f":"+IF(Validaciones!A127=\"\",\"\",Validaciones!A127)","v":"ENTRENAMIENTOS ADMINISTRATIVOS"},{"$f":"+IF(Validaciones!B127=\"\",\"\",Validaciones!B127)","v":"Capacitación para independientes y afiliados sobre los deberes y derechos en el  SGRL y definiciones según normatividad"},{"$f":"+IF(Validaciones!C127=\"\",\"\",Validaciones!C127)","v":"Empresas  e independientes voluntarios - mayor información en:\nAtención al cliente - tel. 3077050 "},{"$f":"+IF(Validaciones!D127=\"\",\"\",Validaciones!D127)","v":"PRESENCIAL "},{"$f":"+IF(Validaciones!E127=\"\",\"\",Validaciones!E127)","v":"MEDELLÍN "},{"$f":"+IF(Validaciones!F127=\"\",\"\",Validaciones!F127)","v":"2019-05-15"},{"$f":"+IF(Validaciones!G127=\"\",\"\",Validaciones!G127)","v":"8:00 AM - 11:00A M"},{"$f":"+IF(Validaciones!H127=\"\",\"\",Validaciones!H127)","v":"Cra 43A No. 19-17, Piso 15"},{"$f":"+IF(Validaciones!I127=\"\",\"\",Validaciones!I127)","v":2},null,{"$f":"+IF(Validaciones!I129=\"\",\"\",Validaciones!I129)","v":2},{"$f":"IF(B133=\"\",\"\",+VLOOKUP(B133,'PRESENCIAL NACIONAL - VIRTUALES'!C:N,12,0))","v":0}]
[{"$f":"+IF(Validaciones!A128=\"\",\"\",Validaciones!A128)","v":"ENTRENAMIENTOS ADMINISTRATIVOS"},{"$f":"+IF(Validaciones!B128=\"\",\"\",Validaciones!B128)","v":"Capacitación para independientes y afiliados sobre los deberes y derechos en el  SGRL y definiciones según normatividad"},{"$f":"+IF(Validaciones!C128=\"\",\"\",Validaciones!C128)","v":"Empresas  e independientes voluntarios - mayor información en:\nAtención al cliente - tel. 3077050 "},{"$f":"+IF(Validaciones!D128=\"\",\"\",Validaciones!D128)","v":"PRESENCIAL "},{"$f":"+IF(Validaciones!E128=\"\",\"\",Validaciones!E128)","v":"MEDELLÍN "},{"$f":"+IF(Validaciones!F128=\"\",\"\",Validaciones!F128)","v":"2019-06-12"},{"$f":"+IF(Validaciones!G128=\"\",\"\",Validaciones!G128)","v":"8:00 AM - 11:00A M"},{"$f":"+IF(Validaciones!H128=\"\",\"\",Validaciones!H128)","v":"Cra 43A No. 19-17, Piso 15"},{"$f":"+IF(Validaciones!I128=\"\",\"\",Validaciones!I128)","v":2},null,{"$f":"+IF(Validaciones!I130=\"\",\"\",Validaciones!I130)","v":2},{"$f":"IF(B134=\"\",\"\",+VLOOKUP(B134,'PRESENCIAL NACIONAL - VIRTUALES'!C:N,12,0))","v":0}]
[{"$f":"+IF(Validaciones!A129=\"\",\"\",Validaciones!A129)","v":"ENTRENAMIENTOS ADMINISTRATIVOS"},{"$f":"+IF(Validaciones!B129=\"\",\"\",Validaciones!B129)","v":"Capacitación para independientes y afiliados sobre los deberes y derechos en el  SGRL y definiciones según normatividad"},{"$f":"+IF(Validaciones!C129=\"\",\"\",Validaciones!C129)","v":"Empresas  e independientes voluntarios - mayor información en:\nAtención al cliente - tel. 3077050 "},{"$f":"+IF(Validaciones!D129=\"\",\"\",Validaciones!D129)","v":"PRESENCIAL "},{"$f":"+IF(Validaciones!E129=\"\",\"\",Validaciones!E129)","v":"MEDELLÍN "},{"$f":"+IF(Validaciones!F129=\"\",\"\",Validaciones!F129)","v":"2019-07-17"},{"$f":"+IF(Validaciones!G129=\"\",\"\",Validaciones!G129)","v":"8:00 AM - 11:00A M"},{"$f":"+IF(Validaciones!H129=\"\",\"\",Validaciones!H129)","v":"Cra 43A No. 19-17, Piso 15"},{"$f":"+IF(Validaciones!I129=\"\",\"\",Validaciones!I129)","v":2},null,{"$f":"+IF(Validaciones!I131=\"\",\"\",Validaciones!I131)","v":2},{"$f":"IF(B135=\"\",\"\",+VLOOKUP(B135,'PRESENCIAL NACIONAL - VIRTUALES'!C:N,12,0))","v":0}]
[{"$f":"+IF(Validaciones!A130=\"\",\"\",Validaciones!A130)","v":"ENTRENAMIENTOS ADMINISTRATIVOS"},{"$f":"+IF(Validaciones!B130=\"\",\"\",Validaciones!B130)","v":"Capacitación para independientes y afiliados sobre los deberes y derechos en el  SGRL y definiciones según normatividad"},{"$f":"+IF(Validaciones!C130=\"\",\"\",Validaciones!C130)","v":"Empresas  e independientes voluntarios - mayor información en:\nAtención al cliente - tel. 3077050 "},{"$f":"+IF(Validaciones!D130=\"\",\"\",Validaciones!D130)","v":"PRESENCIAL "},{"$f":"+IF(Validaciones!E130=\"\",\"\",Validaciones!E130)","v":"MEDELLÍN "},{"$f":"+IF(Validaciones!F130=\"\",\"\",Validaciones!F130)","v":"2019-08-14"},{"$f":"+IF(Validaciones!G130=\"\",\"\",Validaciones!G130)","v":"8:00 AM - 11:00A M"},{"$f":"+IF(Validaciones!H130=\"\",\"\",Validaciones!H130)","v":"Cra 43A No. 19-17, Piso 15"},{"$f":"+IF(Validaciones!I130=\"\",\"\",Validaciones!I130)","v":2},null,{"$f":"+IF(Validaciones!I132=\"\",\"\",Validaciones!I132)","v":2},{"$f":"IF(B136=\"\",\"\",+VLOOKUP(B136,'PRESENCIAL NACIONAL - VIRTUALES'!C:N,12,0))","v":0}]
[{"$f":"+IF(Validaciones!A131=\"\",\"\",Validaciones!A131)","v":"ENTRENAMIENTOS ADMINISTRATIVOS"},{"$f":"+IF(Validaciones!B131=\"\",\"\",Validaciones!B131)","v":"Capacitación para independientes y afiliados sobre los deberes y derechos en el  SGRL y definiciones según normatividad"},{"$f":"+IF(Validaciones!C131=\"\",\"\",Validaciones!C131)","v":"Empresas  e independientes voluntarios - mayor información en:\nAtención al cliente - tel. 3077050 "},{"$f":"+IF(Validaciones!D131=\"\",\"\",Validaciones!D131)","v":"PRESENCIAL "},{"$f":"+IF(Validaciones!E131=\"\",\"\",Validaciones!E131)","v":"MEDELLÍN "},{"$f":"+IF(Validaciones!F131=\"\",\"\",Validaciones!F131)","v":"2019-09-11"},{"$f":"+IF(Validaciones!G131=\"\",\"\",Validaciones!G131)","v":"8:00 AM - 11:00A M"},{"$f":"+IF(Validaciones!H131=\"\",\"\",Validaciones!H131)","v":"Cra 43A No. 19-17, Piso 15"},{"$f":"+IF(Validaciones!I131=\"\",\"\",Validaciones!I131)","v":2},null,{"$f":"+IF(Validaciones!I133=\"\",\"\",Validaciones!I133)","v":2},{"$f":"IF(B137=\"\",\"\",+VLOOKUP(B137,'PRESENCIAL NACIONAL - VIRTUALES'!C:N,12,0))","v":0}]
[{"$f":"+IF(Validaciones!A132=\"\",\"\",Validaciones!A132)","v":"ENTRENAMIENTOS ADMINISTRATIVOS"},{"$f":"+IF(Validaciones!B132=\"\",\"\",Validaciones!B132)","v":"Capacitación para independientes y afiliados sobre los deberes y derechos en el  SGRL y definiciones según normatividad"},{"$f":"+IF(Validaciones!C132=\"\",\"\",Validaciones!C132)","v":"Empresas  e independientes voluntarios - mayor información en:\nAtención al cliente - tel. 3077050 "},{"$f":"+IF(Validaciones!D132=\"\",\"\",Validaciones!D132)","v":"PRESENCIAL "},{"$f":"+IF(Validaciones!E132=\"\",\"\",Validaciones!E132)","v":"MEDELLÍN "},{"$f":"+IF(Validaciones!F132=\"\",\"\",Validaciones!F132)","v":"2019-10-09"},{"$f":"+IF(Validaciones!G132=\"\",\"\",Validaciones!G132)","v":"8:00 AM - 11:00A M"},{"$f":"+IF(Validaciones!H132=\"\",\"\",Validaciones!H132)","v":"Cra 43A No. 19-17, Piso 15"},{"$f":"+IF(Validaciones!I132=\"\",\"\",Validaciones!I132)","v":2},null,{"$f":"+IF(Validaciones!I134=\"\",\"\",Validaciones!I134)","v":200},{"$f":"IF(B138=\"\",\"\",+VLOOKUP(B138,'PRESENCIAL NACIONAL - VIRTUALES'!C:N,12,0))","v":0}]
[{"$f":"+IF(Validaciones!A133=\"\",\"\",Validaciones!A133)","v":"ENTRENAMIENTOS ADMINISTRATIVOS"},{"$f":"+IF(Validaciones!B133=\"\",\"\",Validaciones!B133)","v":"Capacitación para independientes y afiliados sobre los deberes y derechos en el  SGRL y definiciones según normatividad"},{"$f":"+IF(Validaciones!C133=\"\",\"\",Validaciones!C133)","v":"Empresas  e independientes voluntarios - mayor información en:\nAtención al cliente - tel. 3077050 "},{"$f":"+IF(Validaciones!D133=\"\",\"\",Validaciones!D133)","v":"PRESENCIAL "},{"$f":"+IF(Validaciones!E133=\"\",\"\",Validaciones!E133)","v":"MEDELLÍN "},{"$f":"+IF(Validaciones!F133=\"\",\"\",Validaciones!F133)","v":"2019-12-11"},{"$f":"+IF(Validaciones!G133=\"\",\"\",Validaciones!G133)","v":"8:00 AM - 11:00A M"},{"$f":"+IF(Validaciones!H133=\"\",\"\",Validaciones!H133)","v":"Cra 43A No. 19-17, Piso 15"},{"$f":"+IF(Validaciones!I133=\"\",\"\",Validaciones!I133)","v":2},null,{"$f":"+IF(Validaciones!I135=\"\",\"\",Validaciones!I135)","v":200},{"$f":"IF(B139=\"\",\"\",+VLOOKUP(B139,'PRESENCIAL NACIONAL - VIRTUALES'!C:N,12,0))","v":0}]
[{"$f":"+IF(Validaciones!A134=\"\",\"\",Validaciones!A134)","v":"ENTRENAMIENTOS PÁGINA WEB"},{"$f":"+IF(Validaciones!B134=\"\",\"\",Validaciones!B134)","v":"Capacitación Web Masiva empresas activas"},{"$f":"+IF(Validaciones!C134=\"\",\"\",Validaciones!C134)","v":"Empresas afiliadas a ARL Liberty  "},{"$f":"+IF(Validaciones!D134=\"\",\"\",Validaciones!D134)","v":"VIRTUAL "},{"$f":"+IF(Validaciones!E134=\"\",\"\",Validaciones!E134)","v":"NACIONAL"},{"$f":"+IF(Validaciones!F134=\"\",\"\",Validaciones!F134)","v":"2019-02-14"},{"$f":"+IF(Validaciones!G134=\"\",\"\",Validaciones!G134)","v":"8:30 AM - 10:30A M"},{"$f":"+IF(Validaciones!H134=\"\",\"\",Validaciones!H134)","v":"Liberty University"},{"$f":"+IF(Validaciones!I134=\"\",\"\",Validaciones!I134)","v":200},null,{"$f":"+IF(Validaciones!I136=\"\",\"\",Validaciones!I136)","v":200},{"$f":"IF(B140=\"\",\"\",+VLOOKUP(B140,'PRESENCIAL NACIONAL - VIRTUALES'!C:N,12,0))","v":0}]
[{"$f":"+IF(Validaciones!A135=\"\",\"\",Validaciones!A135)","v":"ENTRENAMIENTOS PÁGINA WEB"},{"$f":"+IF(Validaciones!B135=\"\",\"\",Validaciones!B135)","v":"Capacitación Web Masiva empresas activas"},{"$f":"+IF(Validaciones!C135=\"\",\"\",Validaciones!C135)","v":"Empresas afiliadas a ARL Liberty  "},{"$f":"+IF(Validaciones!D135=\"\",\"\",Validaciones!D135)","v":"VIRTUAL "},{"$f":"+IF(Validaciones!E135=\"\",\"\",Validaciones!E135)","v":"NACIONAL"},{"$f":"+IF(Validaciones!F135=\"\",\"\",Validaciones!F135)","v":"2019-05-16"},{"$f":"+IF(Validaciones!G135=\"\",\"\",Validaciones!G135)","v":"8:30 AM - 10:30A M"},{"$f":"+IF(Validaciones!H135=\"\",\"\",Validaciones!H135)","v":"Liberty University"},{"$f":"+IF(Validaciones!I135=\"\",\"\",Validaciones!I135)","v":200},null,{"$f":"+IF(Validaciones!I137=\"\",\"\",Validaciones!I137)","v":200},{"$f":"IF(B141=\"\",\"\",+VLOOKUP(B141,'PRESENCIAL NACIONAL - VIRTUALES'!C:N,12,0))","v":0}]
[{"$f":"+IF(Validaciones!A136=\"\",\"\",Validaciones!A136)","v":"ENTRENAMIENTOS PÁGINA WEB"},{"$f":"+IF(Validaciones!B136=\"\",\"\",Validaciones!B136)","v":"Capacitación Web Masiva empresas activas"},{"$f":"+IF(Validaciones!C136=\"\",\"\",Validaciones!C136)","v":"Empresas afiliadas a ARL Liberty  "},{"$f":"+IF(Validaciones!D136=\"\",\"\",Validaciones!D136)","v":"VIRTUAL "},{"$f":"+IF(Validaciones!E136=\"\",\"\",Validaciones!E136)","v":"NACIONAL"},{"$f":"+IF(Validaciones!F136=\"\",\"\",Validaciones!F136)","v":"2019-08-15"},{"$f":"+IF(Validaciones!G136=\"\",\"\",Validaciones!G136)","v":"8:30 AM - 10:30A M"},{"$f":"+IF(Validaciones!H136=\"\",\"\",Validaciones!H136)","v":"Liberty University"},{"$f":"+IF(Validaciones!I136=\"\",\"\",Validaciones!I136)","v":200},null,{"$f":"+IF(Validaciones!I138=\"\",\"\",Validaciones!I138)","v":200},{"$f":"IF(B142=\"\",\"\",+VLOOKUP(B142,'PRESENCIAL NACIONAL - VIRTUALES'!C:N,12,0))","v":0}]
[{"$f":"+IF(Validaciones!A137=\"\",\"\",Validaciones!A137)","v":"ESTILOS DE VIDA Y TRABAJO SALUDABLE"},{"$f":"+IF(Validaciones!B137=\"\",\"\",Validaciones!B137)","v":"Importancia del programa de  estilos de vida y trabajo saludable y relación con los perfiles epidemiológicos."},{"$f":"+IF(Validaciones!C137=\"\",\"\",Validaciones!C137)","v":"Personal afiliado a Liberty Seguros. "},{"$f":"+IF(Validaciones!D137=\"\",\"\",Validaciones!D137)","v":"VIRTUAL "},{"$f":"+IF(Validaciones!E137=\"\",\"\",Validaciones!E137)","v":"NACIONAL"},{"$f":"+IF(Validaciones!F137=\"\",\"\",Validaciones!F137)","v":"2019-06-19"},{"$f":"+IF(Validaciones!G137=\"\",\"\",Validaciones!G137)","v":"2:00 p.m. a 5:00 p.m."},{"$f":"+IF(Validaciones!H137=\"\",\"\",Validaciones!H137)","v":"Liberty University"},{"$f":"+IF(Validaciones!I137=\"\",\"\",Validaciones!I137)","v":200},null,{"$f":"+IF(Validaciones!I139=\"\",\"\",Validaciones!I139)","v":200},{"$f":"IF(B143=\"\",\"\",+VLOOKUP(B143,'PRESENCIAL NACIONAL - VIRTUALES'!C:N,12,0))","v":0}]
[{"$f":"+IF(Validaciones!A138=\"\",\"\",Validaciones!A138)","v":"EXCEL EN SGSST"},{"$f":"+IF(Validaciones!B138=\"\",\"\",Validaciones!B138)","v":"Herramientas de Excel para la formulación de bases de información del sistema de gestión ( validaciones y fórmulas) y tabla dinámica. "},{"$f":"+IF(Validaciones!C138=\"\",\"\",Validaciones!C138)","v":"Afiliados a ARL Liberty "},{"$f":"+IF(Validaciones!D138=\"\",\"\",Validaciones!D138)","v":"VIRTUAL "},{"$f":"+IF(Validaciones!E138=\"\",\"\",Validaciones!E138)","v":"NACIONAL"},{"$f":"+IF(Validaciones!F138=\"\",\"\",Validaciones!F138)","v":"2019-10-31"},{"$f":"+IF(Validaciones!G138=\"\",\"\",Validaciones!G138)","v":"Abierto"},{"$f":"+IF(Validaciones!H138=\"\",\"\",Validaciones!H138)","v":"Liberty University"},{"$f":"+IF(Validaciones!I138=\"\",\"\",Validaciones!I138)","v":200},null,{"$f":"+IF(Validaciones!I140=\"\",\"\",Validaciones!I140)","v":200},{"$f":"IF(B144=\"\",\"\",+VLOOKUP(B144,'PRESENCIAL NACIONAL - VIRTUALES'!C:N,12,0))","v":0}]
[{"$f":"+IF(Validaciones!A139=\"\",\"\",Validaciones!A139)","v":"LEGISLACIÓN SG SST"},{"$f":"+IF(Validaciones!B139=\"\",\"\",Validaciones!B139)","v":"Actualización legal y normas en evolución  en el SGSST"},{"$f":"+IF(Validaciones!C139=\"\",\"\",Validaciones!C139)","v":"Los participantes deben estar afiliados a la ARL LIBERTY  y  tener a cargo el Sistema de Gestión de Seguridad y Salud en el Trabajo o pertenecer al área de Recursos Humanos o al área jurídica"},{"$f":"+IF(Validaciones!D139=\"\",\"\",Validaciones!D139)","v":"VIRTUAL "},{"$f":"+IF(Validaciones!E139=\"\",\"\",Validaciones!E139)","v":"NACIONAL"},{"$f":"+IF(Validaciones!F139=\"\",\"\",Validaciones!F139)","v":"2019-08-15"},{"$f":"+IF(Validaciones!G139=\"\",\"\",Validaciones!G139)","v":"2:30 - 4:30 PM"},{"$f":"+IF(Validaciones!H139=\"\",\"\",Validaciones!H139)","v":"Liberty University"},{"$f":"+IF(Validaciones!I139=\"\",\"\",Validaciones!I139)","v":200},null,{"$f":"+IF(Validaciones!I141=\"\",\"\",Validaciones!I141)","v":200},{"$f":"IF(B145=\"\",\"\",+VLOOKUP(B145,'PRESENCIAL NACIONAL - VIRTUALES'!C:N,12,0))","v":0}]
[{"$f":"+IF(Validaciones!A140=\"\",\"\",Validaciones!A140)","v":"LEGISLACIÓN SG SST"},{"$f":"+IF(Validaciones!B140=\"\",\"\",Validaciones!B140)","v":"Actualización legal y normas en evolución  en el SGSST"},{"$f":"+IF(Validaciones!C140=\"\",\"\",Validaciones!C140)","v":"Los participantes deben estar afiliados a la ARL LIBERTY  y  tener a cargo el Sistema de Gestión de Seguridad y Salud en el Trabajo o pertenecer al área de Recursos Humanos o al área jurídica"},{"$f":"+IF(Validaciones!D140=\"\",\"\",Validaciones!D140)","v":"VIRTUAL "},{"$f":"+IF(Validaciones!E140=\"\",\"\",Validaciones!E140)","v":"NACIONAL"},{"$f":"+IF(Validaciones!F140=\"\",\"\",Validaciones!F140)","v":"2019-04-11"},{"$f":"+IF(Validaciones!G140=\"\",\"\",Validaciones!G140)","v":"2:30 - 4:30 PM"},{"$f":"+IF(Validaciones!H140=\"\",\"\",Validaciones!H140)","v":"Liberty University"},{"$f":"+IF(Validaciones!I140=\"\",\"\",Validaciones!I140)","v":200},null,{"$f":"+IF(Validaciones!I142=\"\",\"\",Validaciones!I142)","v":200},{"$f":"IF(B146=\"\",\"\",+VLOOKUP(B146,'PRESENCIAL NACIONAL - VIRTUALES'!C:N,12,0))","v":0}]
[{"$f":"+IF(Validaciones!A141=\"\",\"\",Validaciones!A141)","v":"MANEJO SEGURO DE MONTACARGAS"},{"$f":"+IF(Validaciones!B141=\"\",\"\",Validaciones!B141)","v":"Capacitación en manejo seguro de montacargas"},{"$f":"+IF(Validaciones!C141=\"\",\"\",Validaciones!C141)","v":"Trabajadores que manejen montacargas dentro de su labor. "},{"$f":"+IF(Validaciones!D141=\"\",\"\",Validaciones!D141)","v":"VIRTUAL "},{"$f":"+IF(Validaciones!E141=\"\",\"\",Validaciones!E141)","v":"NACIONAL"},{"$f":"+IF(Validaciones!F141=\"\",\"\",Validaciones!F141)","v":"2018-05-24"},{"$f":"+IF(Validaciones!G141=\"\",\"\",Validaciones!G141)","v":"2:00 a 4:00 p.m."},{"$f":"+IF(Validaciones!H141=\"\",\"\",Validaciones!H141)","v":"Liberty University"},{"$f":"+IF(Validaciones!I141=\"\",\"\",Validaciones!I141)","v":200},null,{"$f":"+IF(Validaciones!I143=\"\",\"\",Validaciones!I143)","v":200},{"$f":"IF(B147=\"\",\"\",+VLOOKUP(B147,'PRESENCIAL NACIONAL - VIRTUALES'!C:N,12,0))","v":0}]
[{"$f":"+IF(Validaciones!A142=\"\",\"\",Validaciones!A142)","v":"MEJOR PREVENIR PARA GANAR"},{"$f":"+IF(Validaciones!B142=\"\",\"\",Validaciones!B142)","v":"RCP: Reporte de condiciones peligrosas"},{"$f":"+IF(Validaciones!C142=\"\",\"\",Validaciones!C142)","v":"Responsable del sistema de gestión, copasst y líderes."},{"$f":"+IF(Validaciones!D142=\"\",\"\",Validaciones!D142)","v":"VIRTUAL "},{"$f":"+IF(Validaciones!E142=\"\",\"\",Validaciones!E142)","v":"NACIONAL"},{"$f":"+IF(Validaciones!F142=\"\",\"\",Validaciones!F142)","v":"2019-10-31"},{"$f":"+IF(Validaciones!G142=\"\",\"\",Validaciones!G142)","v":"Abierto "},{"$f":"+IF(Validaciones!H142=\"\",\"\",Validaciones!H142)","v":"Liberty University"},{"$f":"+IF(Validaciones!I142=\"\",\"\",Validaciones!I142)","v":200},null,{"$f":"+IF(Validaciones!I144=\"\",\"\",Validaciones!I144)","v":200},{"$f":"IF(B148=\"\",\"\",+VLOOKUP(B148,'PRESENCIAL NACIONAL - VIRTUALES'!C:N,12,0))","v":0}]
[{"$f":"+IF(Validaciones!A143=\"\",\"\",Validaciones!A143)","v":"MEJOR PREVENIR PARA GANAR"},{"$f":"+IF(Validaciones!B143=\"\",\"\",Validaciones!B143)","v":"MVP: Gerenciando comportamientos vitales"},{"$f":"+IF(Validaciones!C143=\"\",\"\",Validaciones!C143)","v":"Responsable del sistema de gestión, copasst y líderes."},{"$f":"+IF(Validaciones!D143=\"\",\"\",Validaciones!D143)","v":"VIRTUAL "},{"$f":"+IF(Validaciones!E143=\"\",\"\",Validaciones!E143)","v":"NACIONAL"},{"$f":"+IF(Validaciones!F143=\"\",\"\",Validaciones!F143)","v":"2019-10-31"},{"$f":"+IF(Validaciones!G143=\"\",\"\",Validaciones!G143)","v":"Abierto "},{"$f":"+IF(Validaciones!H143=\"\",\"\",Validaciones!H143)","v":"Liberty University"},{"$f":"+IF(Validaciones!I143=\"\",\"\",Validaciones!I143)","v":200},null,{"$f":"+IF(Validaciones!I145=\"\",\"\",Validaciones!I145)","v":200},{"$f":"IF(B149=\"\",\"\",+VLOOKUP(B149,'PRESENCIAL NACIONAL - VIRTUALES'!C:N,12,0))","v":0}]
[{"$f":"+IF(Validaciones!A144=\"\",\"\",Validaciones!A144)","v":"MEJOR PREVENIR PARA GANAR"},{"$f":"+IF(Validaciones!B144=\"\",\"\",Validaciones!B144)","v":"Dejando Huella: Programa de prevención caídas a nivel "},{"$f":"+IF(Validaciones!C144=\"\",\"\",Validaciones!C144)","v":"Responsable del sistema de gestión, copasst y líderes."},{"$f":"+IF(Validaciones!D144=\"\",\"\",Validaciones!D144)","v":"VIRTUAL "},{"$f":"+IF(Validaciones!E144=\"\",\"\",Validaciones!E144)","v":"NACIONAL"},{"$f":"+IF(Validaciones!F144=\"\",\"\",Validaciones!F144)","v":"2019-10-31"},{"$f":"+IF(Validaciones!G144=\"\",\"\",Validaciones!G144)","v":"Abierto "},{"$f":"+IF(Validaciones!H144=\"\",\"\",Validaciones!H144)","v":"Liberty University"},{"$f":"+IF(Validaciones!I144=\"\",\"\",Validaciones!I144)","v":200},null,{"$f":"+IF(Validaciones!I146=\"\",\"\",Validaciones!I146)","v":200},{"$f":"IF(B150=\"\",\"\",+VLOOKUP(B150,'PRESENCIAL NACIONAL - VIRTUALES'!C:N,12,0))","v":0}]
[{"$f":"+IF(Validaciones!A145=\"\",\"\",Validaciones!A145)","v":"MEJOR PREVENIR PARA GANAR"},{"$f":"+IF(Validaciones!B145=\"\",\"\",Validaciones!B145)","v":"Programa Estrella: Programa de orden y aseo."},{"$f":"+IF(Validaciones!C145=\"\",\"\",Validaciones!C145)","v":"Responsable del sistema de gestión, copasst y líderes."},{"$f":"+IF(Validaciones!D145=\"\",\"\",Validaciones!D145)","v":"VIRTUAL "},{"$f":"+IF(Validaciones!E145=\"\",\"\",Validaciones!E145)","v":"NACIONAL"},{"$f":"+IF(Validaciones!F145=\"\",\"\",Validaciones!F145)","v":"2019-10-31"},{"$f":"+IF(Validaciones!G145=\"\",\"\",Validaciones!G145)","v":"Abierto "},{"$f":"+IF(Validaciones!H145=\"\",\"\",Validaciones!H145)","v":"Liberty University"},{"$f":"+IF(Validaciones!I145=\"\",\"\",Validaciones!I145)","v":200},null,{"$f":"+IF(Validaciones!I147=\"\",\"\",Validaciones!I147)","v":200},{"$f":"IF(B151=\"\",\"\",+VLOOKUP(B151,'PRESENCIAL NACIONAL - VIRTUALES'!C:N,12,0))","v":0}]
[{"$f":"+IF(Validaciones!A146=\"\",\"\",Validaciones!A146)","v":"MEJOR PREVENIR PARA GANAR"},{"$f":"+IF(Validaciones!B146=\"\",\"\",Validaciones!B146)","v":"Sistemas de Vigilancia Epidemiológica. "},{"$f":"+IF(Validaciones!C146=\"\",\"\",Validaciones!C146)","v":"Responsable del sistema de gestión, copasst y líderes."},{"$f":"+IF(Validaciones!D146=\"\",\"\",Validaciones!D146)","v":"VIRTUAL "},{"$f":"+IF(Validaciones!E146=\"\",\"\",Validaciones!E146)","v":"NACIONAL"},{"$f":"+IF(Validaciones!F146=\"\",\"\",Validaciones!F146)","v":"2019-10-31"},{"$f":"+IF(Validaciones!G146=\"\",\"\",Validaciones!G146)","v":"Abierto"},{"$f":"+IF(Validaciones!H146=\"\",\"\",Validaciones!H146)","v":"Liberty University"},{"$f":"+IF(Validaciones!I146=\"\",\"\",Validaciones!I146)","v":200},null,{"$f":"+IF(Validaciones!I148=\"\",\"\",Validaciones!I148)","v":200},{"$f":"IF(B152=\"\",\"\",+VLOOKUP(B152,'PRESENCIAL NACIONAL - VIRTUALES'!C:N,12,0))","v":0}]
[{"$f":"+IF(Validaciones!A147=\"\",\"\",Validaciones!A147)","v":"MEJOR PREVENIR PARA GANAR"},{"$f":"+IF(Validaciones!B147=\"\",\"\",Validaciones!B147)","v":"SMD: Sistema de manejo decisivo "},{"$f":"+IF(Validaciones!C147=\"\",\"\",Validaciones!C147)","v":"Responsable del sistema de gestión, copasst y líderes."},{"$f":"+IF(Validaciones!D147=\"\",\"\",Validaciones!D147)","v":"VIRTUAL "},{"$f":"+IF(Validaciones!E147=\"\",\"\",Validaciones!E147)","v":"NACIONAL"},{"$f":"+IF(Validaciones!F147=\"\",\"\",Validaciones!F147)","v":"2019-10-31"},{"$f":"+IF(Validaciones!G147=\"\",\"\",Validaciones!G147)","v":"Abierto "},{"$f":"+IF(Validaciones!H147=\"\",\"\",Validaciones!H147)","v":"Liberty University"},{"$f":"+IF(Validaciones!I147=\"\",\"\",Validaciones!I147)","v":200},null,{"$f":"+IF(Validaciones!I149=\"\",\"\",Validaciones!I149)","v":200},{"$f":"IF(B153=\"\",\"\",+VLOOKUP(B153,'PRESENCIAL NACIONAL - VIRTUALES'!C:N,12,0))","v":0}]
[{"$f":"+IF(Validaciones!A148=\"\",\"\",Validaciones!A148)","v":"MEJOR PREVENIR PARA GANAR"},{"$f":"+IF(Validaciones!B148=\"\",\"\",Validaciones!B148)","v":"Manos a la obra:  Programa de prevención de accidentes en manos"},{"$f":"+IF(Validaciones!C148=\"\",\"\",Validaciones!C148)","v":"Responsable del sistema de gestión, copasst y líderes."},{"$f":"+IF(Validaciones!D148=\"\",\"\",Validaciones!D148)","v":"VIRTUAL "},{"$f":"+IF(Validaciones!E148=\"\",\"\",Validaciones!E148)","v":"NACIONAL"},{"$f":"+IF(Validaciones!F148=\"\",\"\",Validaciones!F148)","v":"2019-10-31"},{"$f":"+IF(Validaciones!G148=\"\",\"\",Validaciones!G148)","v":"Abierto "},{"$f":"+IF(Validaciones!H148=\"\",\"\",Validaciones!H148)","v":"Liberty University"},{"$f":"+IF(Validaciones!I148=\"\",\"\",Validaciones!I148)","v":200},null,{"$f":"+IF(Validaciones!I150=\"\",\"\",Validaciones!I150)","v":200},{"$f":"IF(B154=\"\",\"\",+VLOOKUP(B154,'PRESENCIAL NACIONAL - VIRTUALES'!C:N,12,0))","v":0}]
[{"$f":"+IF(Validaciones!A149=\"\",\"\",Validaciones!A149)","v":"MEJOR PREVENIR PARA GANAR"},{"$f":"+IF(Validaciones!B149=\"\",\"\",Validaciones!B149)","v":"Control de Fuentes de pérdida"},{"$f":"+IF(Validaciones!C149=\"\",\"\",Validaciones!C149)","v":"Responsable del sistema de gestión, copasst y líderes."},{"$f":"+IF(Validaciones!D149=\"\",\"\",Validaciones!D149)","v":"VIRTUAL "},{"$f":"+IF(Validaciones!E149=\"\",\"\",Validaciones!E149)","v":"NACIONAL"},{"$f":"+IF(Validaciones!F149=\"\",\"\",Validaciones!F149)","v":"2019-10-31"},{"$f":"+IF(Validaciones!G149=\"\",\"\",Validaciones!G149)","v":"Abierto"},{"$f":"+IF(Validaciones!H149=\"\",\"\",Validaciones!H149)","v":"Liberty University"},{"$f":"+IF(Validaciones!I149=\"\",\"\",Validaciones!I149)","v":200},null,{"$f":"+IF(Validaciones!I151=\"\",\"\",Validaciones!I151)","v":200},{"$f":"IF(B155=\"\",\"\",+VLOOKUP(B155,'PRESENCIAL NACIONAL - VIRTUALES'!C:N,12,0))","v":0}]
[{"$f":"+IF(Validaciones!A150=\"\",\"\",Validaciones!A150)","v":"MEJOR PREVENIR PARA GANAR"},{"$f":"+IF(Validaciones!B150=\"\",\"\",Validaciones!B150)","v":"O.S.M. Programa Operación Segura de Máquina.   "},{"$f":"+IF(Validaciones!C150=\"\",\"\",Validaciones!C150)","v":"Responsable del sistema de gestión, copasst y líderes."},{"$f":"+IF(Validaciones!D150=\"\",\"\",Validaciones!D150)","v":"VIRTUAL "},{"$f":"+IF(Validaciones!E150=\"\",\"\",Validaciones!E150)","v":"NACIONAL"},{"$f":"+IF(Validaciones!F150=\"\",\"\",Validaciones!F150)","v":"2019-10-31"},{"$f":"+IF(Validaciones!G150=\"\",\"\",Validaciones!G150)","v":"Abierto "},{"$f":"+IF(Validaciones!H150=\"\",\"\",Validaciones!H150)","v":"Liberty University"},{"$f":"+IF(Validaciones!I150=\"\",\"\",Validaciones!I150)","v":200},null,{"$f":"+IF(Validaciones!I152=\"\",\"\",Validaciones!I152)","v":200},{"$f":"IF(B156=\"\",\"\",+VLOOKUP(B156,'PRESENCIAL NACIONAL - VIRTUALES'!C:N,12,0))","v":0}]
[{"$f":"+IF(Validaciones!A151=\"\",\"\",Validaciones!A151)","v":"MEJOR PREVENIR PARA GANAR"},{"$f":"+IF(Validaciones!B151=\"\",\"\",Validaciones!B151)","v":"AOSE Arquitectura de la excelencia en la seguridad "},{"$f":"+IF(Validaciones!C151=\"\",\"\",Validaciones!C151)","v":"Responsable del sistema de gestión. "},{"$f":"+IF(Validaciones!D151=\"\",\"\",Validaciones!D151)","v":"VIRTUAL "},{"$f":"+IF(Validaciones!E151=\"\",\"\",Validaciones!E151)","v":"NACIONAL"},{"$f":"+IF(Validaciones!F151=\"\",\"\",Validaciones!F151)","v":"2019-10-31"},{"$f":"+IF(Validaciones!G151=\"\",\"\",Validaciones!G151)","v":"Abierto"},{"$f":"+IF(Validaciones!H151=\"\",\"\",Validaciones!H151)","v":"Liberty University"},{"$f":"+IF(Validaciones!I151=\"\",\"\",Validaciones!I151)","v":200},null,{"$f":"+IF(Validaciones!I153=\"\",\"\",Validaciones!I153)","v":200},{"$f":"IF(B157=\"\",\"\",+VLOOKUP(B157,'PRESENCIAL NACIONAL - VIRTUALES'!C:N,12,0))","v":0}]
[{"$f":"+IF(Validaciones!A152=\"\",\"\",Validaciones!A152)","v":"PELIGRO MECANICO "},{"$f":"+IF(Validaciones!B152=\"\",\"\",Validaciones!B152)","v":"Curso Peligro Mecánico "},{"$f":"+IF(Validaciones!C152=\"\",\"\",Validaciones!C152)","v":"Personal con exposición a peligro por condición de seguridad dado por riesgo mecánico y responsable del SG-SST "},{"$f":"+IF(Validaciones!D152=\"\",\"\",Validaciones!D152)","v":"VIRTUAL "},{"$f":"+IF(Validaciones!E152=\"\",\"\",Validaciones!E152)","v":"NACIONAL"},{"$f":"+IF(Validaciones!F152=\"\",\"\",Validaciones!F152)","v":"2019-10-31"},{"$f":"+IF(Validaciones!G152=\"\",\"\",Validaciones!G152)","v":"Abierto "},{"$f":"+IF(Validaciones!H152=\"\",\"\",Validaciones!H152)","v":"Liberty University"},{"$f":"+IF(Validaciones!I152=\"\",\"\",Validaciones!I152)","v":200},null,{"$f":"+IF(Validaciones!I154=\"\",\"\",Validaciones!I154)","v":2},{"$f":"IF(B158=\"\",\"\",+VLOOKUP(B158,'PRESENCIAL NACIONAL - VIRTUALES'!C:N,12,0))","v":0}]
[{"$f":"+IF(Validaciones!A153=\"\",\"\",Validaciones!A153)","v":"PLAN ESTRATÉGICO DE SEGURIDAD VIAL. PESV"},{"$f":"+IF(Validaciones!B153=\"\",\"\",Validaciones!B153)","v":"Curso de Seguridad Vial – Embajadores por la seguridad vial."},{"$f":"+IF(Validaciones!C153=\"\",\"\",Validaciones!C153)","v":"Los participantes deben estar afiliados a ARL Liberty y tener a cargo el SG-SST"},{"$f":"+IF(Validaciones!D153=\"\",\"\",Validaciones!D153)","v":"VIRTUAL "},{"$f":"+IF(Validaciones!E153=\"\",\"\",Validaciones!E153)","v":"NACIONAL"},{"$f":"+IF(Validaciones!F153=\"\",\"\",Validaciones!F153)","v":"2019-10-31"},{"$f":"+IF(Validaciones!G153=\"\",\"\",Validaciones!G153)","v":"Abierto "},{"$f":"+IF(Validaciones!H153=\"\",\"\",Validaciones!H153)","v":"Liberty University"},{"$f":"+IF(Validaciones!I153=\"\",\"\",Validaciones!I153)","v":200},null,{"$f":"+IF(Validaciones!I155=\"\",\"\",Validaciones!I155)","v":3},{"$f":"IF(B159=\"\",\"\",+VLOOKUP(B159,'PRESENCIAL NACIONAL - VIRTUALES'!C:N,12,0))","v":0}]
[{"$f":"+IF(Validaciones!A154=\"\",\"\",Validaciones!A154)","v":"PLAN ESTRATÉGICO DE SEGURIDAD VIAL. PESV"},{"$f":"+IF(Validaciones!B154=\"\",\"\",Validaciones!B154)","v":"Capacitación actores de la vía -  seguridad vial "},{"$f":"+IF(Validaciones!C154=\"\",\"\",Validaciones!C154)","v":"Priorizar por el personal que tiene exposición a riesgo vial "},{"$f":"+IF(Validaciones!D154=\"\",\"\",Validaciones!D154)","v":"PRESENCIAL "},{"$f":"+IF(Validaciones!E154=\"\",\"\",Validaciones!E154)","v":"BARRANCABERMEJA"},{"$f":"+IF(Validaciones!F154=\"\",\"\",Validaciones!F154)","v":"2019-05-23"},{"$f":"+IF(Validaciones!G154=\"\",\"\",Validaciones!G154)","v":"8:00 a.m. - 12:00 m"},{"$f":"+IF(Validaciones!H154=\"\",\"\",Validaciones!H154)","v":"Hotel San Silvestre Cra 19 # 58a–13"},{"$f":"+IF(Validaciones!I154=\"\",\"\",Validaciones!I154)","v":2},null,{"$f":"+IF(Validaciones!I156=\"\",\"\",Validaciones!I156)","v":2},{"$f":"IF(B160=\"\",\"\",+VLOOKUP(B160,'PRESENCIAL NACIONAL - VIRTUALES'!C:N,12,0))","v":0}]
[{"$f":"+IF(Validaciones!A155=\"\",\"\",Validaciones!A155)","v":"PLAN ESTRATÉGICO DE SEGURIDAD VIAL. PESV"},{"$f":"+IF(Validaciones!B155=\"\",\"\",Validaciones!B155)","v":"Capacitación actores de la vía -  seguridad vial "},{"$f":"+IF(Validaciones!C155=\"\",\"\",Validaciones!C155)","v":"Priorizar por el personal que tiene exposición a riesgo vial "},{"$f":"+IF(Validaciones!D155=\"\",\"\",Validaciones!D155)","v":"PRESENCIAL "},{"$f":"+IF(Validaciones!E155=\"\",\"\",Validaciones!E155)","v":"BARRANQUILLA"},{"$f":"+IF(Validaciones!F155=\"\",\"\",Validaciones!F155)","v":"2019-10-17"},{"$f":"+IF(Validaciones!G155=\"\",\"\",Validaciones!G155)","v":"8:00 a.m. - 12:00 m"},{"$f":"+IF(Validaciones!H155=\"\",\"\",Validaciones!H155)","v":"ICONTEC Cra 57 No. 70-89 Barranquilla"},{"$f":"+IF(Validaciones!I155=\"\",\"\",Validaciones!I155)","v":3},null,{"$f":"+IF(Validaciones!I157=\"\",\"\",Validaciones!I157)","v":2},{"$f":"IF(B161=\"\",\"\",+VLOOKUP(B161,'PRESENCIAL NACIONAL - VIRTUALES'!C:N,12,0))","v":0}]
[{"$f":"+IF(Validaciones!A156=\"\",\"\",Validaciones!A156)","v":"PLAN ESTRATÉGICO DE SEGURIDAD VIAL. PESV"},{"$f":"+IF(Validaciones!B156=\"\",\"\",Validaciones!B156)","v":"Capacitación actores de la vía -  seguridad vial "},{"$f":"+IF(Validaciones!C156=\"\",\"\",Validaciones!C156)","v":"Priorizar por el personal que tiene exposición a riesgo vial "},{"$f":"+IF(Validaciones!D156=\"\",\"\",Validaciones!D156)","v":"PRESENCIAL "},{"$f":"+IF(Validaciones!E156=\"\",\"\",Validaciones!E156)","v":"BUCARAMANGA"},{"$f":"+IF(Validaciones!F156=\"\",\"\",Validaciones!F156)","v":"2019-05-30"},{"$f":"+IF(Validaciones!G156=\"\",\"\",Validaciones!G156)","v":"8:00 a.m. - 12:00 m"},{"$f":"+IF(Validaciones!H156=\"\",\"\",Validaciones!H156)","v":"Hotel La Triada Cra. 20 #34--22"},{"$f":"+IF(Validaciones!I156=\"\",\"\",Validaciones!I156)","v":2},null,{"$f":"+IF(Validaciones!I158=\"\",\"\",Validaciones!I158)","v":2},{"$f":"IF(B162=\"\",\"\",+VLOOKUP(B162,'PRESENCIAL NACIONAL - VIRTUALES'!C:N,12,0))","v":0}]
[{"$f":"+IF(Validaciones!A157=\"\",\"\",Validaciones!A157)","v":"PLAN ESTRATÉGICO DE SEGURIDAD VIAL. PESV"},{"$f":"+IF(Validaciones!B157=\"\",\"\",Validaciones!B157)","v":"Capacitación actores de la vía -  seguridad vial "},{"$f":"+IF(Validaciones!C157=\"\",\"\",Validaciones!C157)","v":"Priorizar por el personal que tiene exposición a riesgo vial "},{"$f":"+IF(Validaciones!D157=\"\",\"\",Validaciones!D157)","v":"PRESENCIAL "},{"$f":"+IF(Validaciones!E157=\"\",\"\",Validaciones!E157)","v":"CALI"},{"$f":"+IF(Validaciones!F157=\"\",\"\",Validaciones!F157)","v":"2019-05-23"},{"$f":"+IF(Validaciones!G157=\"\",\"\",Validaciones!G157)","v":"8:00 a.m. - 12:00 m"},{"$f":"+IF(Validaciones!H157=\"\",\"\",Validaciones!H157)","v":"Av. 5 Norte # 38N-81"},{"$f":"+IF(Validaciones!I157=\"\",\"\",Validaciones!I157)","v":2},null,{"$f":"+IF(Validaciones!I159=\"\",\"\",Validaciones!I159)","v":4},{"$f":"IF(B163=\"\",\"\",+VLOOKUP(B163,'PRESENCIAL NACIONAL - VIRTUALES'!C:N,12,0))","v":0}]
[{"$f":"+IF(Validaciones!A158=\"\",\"\",Validaciones!A158)","v":"PLAN ESTRATÉGICO DE SEGURIDAD VIAL. PESV"},{"$f":"+IF(Validaciones!B158=\"\",\"\",Validaciones!B158)","v":"Capacitación actores de la vía -  seguridad vial "},{"$f":"+IF(Validaciones!C158=\"\",\"\",Validaciones!C158)","v":"Priorizar por el personal que tiene exposición a riesgo vial "},{"$f":"+IF(Validaciones!D158=\"\",\"\",Validaciones!D158)","v":"PRESENCIAL "},{"$f":"+IF(Validaciones!E158=\"\",\"\",Validaciones!E158)","v":"CARTAGENA"},{"$f":"+IF(Validaciones!F158=\"\",\"\",Validaciones!F158)","v":"2019-05-16"},{"$f":"+IF(Validaciones!G158=\"\",\"\",Validaciones!G158)","v":"8:00 a.m. - 12:00 m"},{"$f":"+IF(Validaciones!H158=\"\",\"\",Validaciones!H158)","v":"Liberty Seguros, Calle del Arsenal No 8B-195 piso 1"},{"$f":"+IF(Validaciones!I158=\"\",\"\",Validaciones!I158)","v":2},null,{"$f":"+IF(Validaciones!I160=\"\",\"\",Validaciones!I160)","v":2},{"$f":"IF(B164=\"\",\"\",+VLOOKUP(B164,'PRESENCIAL NACIONAL - VIRTUALES'!C:N,12,0))","v":0}]
[{"$f":"+IF(Validaciones!A159=\"\",\"\",Validaciones!A159)","v":"PLAN ESTRATÉGICO DE SEGURIDAD VIAL. PESV"},{"$f":"+IF(Validaciones!B159=\"\",\"\",Validaciones!B159)","v":"Capacitación actores de la vía -  seguridad vial "},{"$f":"+IF(Validaciones!C159=\"\",\"\",Validaciones!C159)","v":"Priorizar por el personal que tiene exposición a riesgo vial "},{"$f":"+IF(Validaciones!D159=\"\",\"\",Validaciones!D159)","v":"PRESENCIAL "},{"$f":"+IF(Validaciones!E159=\"\",\"\",Validaciones!E159)","v":"MEDELLÍN "},{"$f":"+IF(Validaciones!F159=\"\",\"\",Validaciones!F159)","v":"2019-02-05"},{"$f":"+IF(Validaciones!G159=\"\",\"\",Validaciones!G159)","v":"8:00 a.m. - 12:00 m"},{"$f":"+IF(Validaciones!H159=\"\",\"\",Validaciones!H159)","v":"Carrera 43A No 19-17, auditorio piso 4 torre norte Block Empresarial"},{"$f":"+IF(Validaciones!I159=\"\",\"\",Validaciones!I159)","v":4},null,{"$f":"+IF(Validaciones!I161=\"\",\"\",Validaciones!I161)","v":2},{"$f":"IF(B165=\"\",\"\",+VLOOKUP(B165,'PRESENCIAL NACIONAL - VIRTUALES'!C:N,12,0))","v":0}]
[{"$f":"+IF(Validaciones!A160=\"\",\"\",Validaciones!A160)","v":"PLAN ESTRATÉGICO DE SEGURIDAD VIAL. PESV"},{"$f":"+IF(Validaciones!B160=\"\",\"\",Validaciones!B160)","v":"Plan Estratégico de Seguridad Vial: \nDónde deben estar las empresas en el PESV hoy? \nCambios en la noma."},{"$f":"+IF(Validaciones!C160=\"\",\"\",Validaciones!C160)","v":"Personal responsable del sistema de gestión de seguridad y salud en el trabajo y/o cargos que rinden cuentas del SG-SST. "},{"$f":"+IF(Validaciones!D160=\"\",\"\",Validaciones!D160)","v":"PRESENCIAL "},{"$f":"+IF(Validaciones!E160=\"\",\"\",Validaciones!E160)","v":"BOGOTÁ"},{"$f":"+IF(Validaciones!F160=\"\",\"\",Validaciones!F160)","v":"2019-11-14"},{"$f":"+IF(Validaciones!G160=\"\",\"\",Validaciones!G160)","v":"8:00 - 12:00 P.M"},{"$f":"+IF(Validaciones!H160=\"\",\"\",Validaciones!H160)","v":"Calle 73 N° 10 - 83 Torre C Oficina 302. Salón 302 Fucsia"},{"$f":"+IF(Validaciones!I160=\"\",\"\",Validaciones!I160)","v":2},null,{"$f":"+IF(Validaciones!I162=\"\",\"\",Validaciones!I162)","v":3},{"$f":"IF(B166=\"\",\"\",+VLOOKUP(B166,'PRESENCIAL NACIONAL - VIRTUALES'!C:N,12,0))","v":0}]
[{"$f":"+IF(Validaciones!A161=\"\",\"\",Validaciones!A161)","v":"PROGRAMA DE GESTIÓN RIESGO QUÍMICO"},{"$f":"+IF(Validaciones!B161=\"\",\"\",Validaciones!B161)","v":"Programa de gestión de riesgo químico y sistema globalmente armonizado "},{"$f":"+IF(Validaciones!C161=\"\",\"\",Validaciones!C161)","v":"Personal responsable del sistema de gestión de seguridad y salud en el trabajo y/o personal de compras - producción "},{"$f":"+IF(Validaciones!D161=\"\",\"\",Validaciones!D161)","v":"PRESENCIAL "},{"$f":"+IF(Validaciones!E161=\"\",\"\",Validaciones!E161)","v":"BARRANCABERMEJA"},{"$f":"+IF(Validaciones!F161=\"\",\"\",Validaciones!F161)","v":"2019-02-21"},{"$f":"+IF(Validaciones!G161=\"\",\"\",Validaciones!G161)","v":"8:00 a.m. - 12:00 m"},{"$f":"+IF(Validaciones!H161=\"\",\"\",Validaciones!H161)","v":"Cra 12 No 49a -18 Barrio Colombia. "},{"$f":"+IF(Validaciones!I161=\"\",\"\",Validaciones!I161)","v":2},null,{"$f":"+IF(Validaciones!I163=\"\",\"\",Validaciones!I163)","v":2},{"$f":"IF(B167=\"\",\"\",+VLOOKUP(B167,'PRESENCIAL NACIONAL - VIRTUALES'!C:N,12,0))","v":"Gestión Interriesgos"}]
[{"$f":"+IF(Validaciones!A162=\"\",\"\",Validaciones!A162)","v":"PROGRAMA DE GESTIÓN RIESGO QUÍMICO"},{"$f":"+IF(Validaciones!B162=\"\",\"\",Validaciones!B162)","v":"Programa de gestión de riesgo químico y sistema globalmente armonizado "},{"$f":"+IF(Validaciones!C162=\"\",\"\",Validaciones!C162)","v":"Personal responsable del sistema de gestión de seguridad y salud en el trabajo y/o personal de compras - producción "},{"$f":"+IF(Validaciones!D162=\"\",\"\",Validaciones!D162)","v":"PRESENCIAL "},{"$f":"+IF(Validaciones!E162=\"\",\"\",Validaciones!E162)","v":"BARRANQUILLA"},{"$f":"+IF(Validaciones!F162=\"\",\"\",Validaciones!F162)","v":"2019-11-07"},{"$f":"+IF(Validaciones!G162=\"\",\"\",Validaciones!G162)","v":"8:00 a.m. - 12:00 m"},{"$f":"+IF(Validaciones!H162=\"\",\"\",Validaciones!H162)","v":"ICONTEC Cra 57 No. 70-89 Barranquilla"},{"$f":"+IF(Validaciones!I162=\"\",\"\",Validaciones!I162)","v":3},null,{"$f":"+IF(Validaciones!I164=\"\",\"\",Validaciones!I164)","v":2},{"$f":"IF(B168=\"\",\"\",+VLOOKUP(B168,'PRESENCIAL NACIONAL - VIRTUALES'!C:N,12,0))","v":"Gestión Interriesgos"}]
[{"$f":"+IF(Validaciones!A163=\"\",\"\",Validaciones!A163)","v":"PROGRAMA DE GESTIÓN RIESGO QUÍMICO"},{"$f":"+IF(Validaciones!B163=\"\",\"\",Validaciones!B163)","v":"Programa de gestión de riesgo químico y sistema globalmente armonizado "},{"$f":"+IF(Validaciones!C163=\"\",\"\",Validaciones!C163)","v":"Personal responsable del sistema de gestión de seguridad y salud en el trabajo y/o personal de compras - producción "},{"$f":"+IF(Validaciones!D163=\"\",\"\",Validaciones!D163)","v":"PRESENCIAL "},{"$f":"+IF(Validaciones!E163=\"\",\"\",Validaciones!E163)","v":"BUCARAMANGA"},{"$f":"+IF(Validaciones!F163=\"\",\"\",Validaciones!F163)","v":"2019-06-06"},{"$f":"+IF(Validaciones!G163=\"\",\"\",Validaciones!G163)","v":"8:00 a.m. - 12:00 m"},{"$f":"+IF(Validaciones!H163=\"\",\"\",Validaciones!H163)","v":"Hotel La Triada Cra. 20 #34--22"},{"$f":"+IF(Validaciones!I163=\"\",\"\",Validaciones!I163)","v":2},null,{"$f":"+IF(Validaciones!I165=\"\",\"\",Validaciones!I165)","v":2},{"$f":"IF(B169=\"\",\"\",+VLOOKUP(B169,'PRESENCIAL NACIONAL - VIRTUALES'!C:N,12,0))","v":"Gestión Interriesgos"}]
[{"$f":"+IF(Validaciones!A164=\"\",\"\",Validaciones!A164)","v":"PROGRAMA DE GESTIÓN RIESGO QUÍMICO"},{"$f":"+IF(Validaciones!B164=\"\",\"\",Validaciones!B164)","v":"Programa de gestión de riesgo químico y sistema globalmente armonizado "},{"$f":"+IF(Validaciones!C164=\"\",\"\",Validaciones!C164)","v":"Personal responsable del sistema de gestión de seguridad y salud en el trabajo y/o personal de compras - producción "},{"$f":"+IF(Validaciones!D164=\"\",\"\",Validaciones!D164)","v":"PRESENCIAL "},{"$f":"+IF(Validaciones!E164=\"\",\"\",Validaciones!E164)","v":"CALI"},{"$f":"+IF(Validaciones!F164=\"\",\"\",Validaciones!F164)","v":"2019-02-21"},{"$f":"+IF(Validaciones!G164=\"\",\"\",Validaciones!G164)","v":"8:00 a.m. - 12:00 m"},{"$f":"+IF(Validaciones!H164=\"\",\"\",Validaciones!H164)","v":"Av. 5 Norte # 38N-81"},{"$f":"+IF(Validaciones!I164=\"\",\"\",Validaciones!I164)","v":2},null,{"$f":"+IF(Validaciones!I166=\"\",\"\",Validaciones!I166)","v":4},{"$f":"IF(B170=\"\",\"\",+VLOOKUP(B170,'PRESENCIAL NACIONAL - VIRTUALES'!C:N,12,0))","v":"Gestión Interriesgos"}]
[{"$f":"+IF(Validaciones!A165=\"\",\"\",Validaciones!A165)","v":"PROGRAMA DE GESTIÓN RIESGO QUÍMICO"},{"$f":"+IF(Validaciones!B165=\"\",\"\",Validaciones!B165)","v":"Programa de gestión de riesgo químico y sistema globalmente armonizado "},{"$f":"+IF(Validaciones!C165=\"\",\"\",Validaciones!C165)","v":"Personal responsable del sistema de gestión de seguridad y salud en el trabajo y/o personal de compras - producción "},{"$f":"+IF(Validaciones!D165=\"\",\"\",Validaciones!D165)","v":"PRESENCIAL "},{"$f":"+IF(Validaciones!E165=\"\",\"\",Validaciones!E165)","v":"BOGOTÁ"},{"$f":"+IF(Validaciones!F165=\"\",\"\",Validaciones!F165)","v":"2019-02-21"},{"$f":"+IF(Validaciones!G165=\"\",\"\",Validaciones!G165)","v":"8:00 a.m. - 12:00 m"},{"$f":"+IF(Validaciones!H165=\"\",\"\",Validaciones!H165)","v":"Calle 73 N° 10 - 83 Torre C Oficina 302. Salón 302 Fucsia"},{"$f":"+IF(Validaciones!I165=\"\",\"\",Validaciones!I165)","v":2},null,{"$f":"+IF(Validaciones!I167=\"\",\"\",Validaciones!I167)","v":200},{"$f":"IF(B171=\"\",\"\",+VLOOKUP(B171,'PRESENCIAL NACIONAL - VIRTUALES'!C:N,12,0))","v":"Gestión Interriesgos"}]
[{"$f":"+IF(Validaciones!A166=\"\",\"\",Validaciones!A166)","v":"PROGRAMA DE GESTIÓN RIESGO QUÍMICO"},{"$f":"+IF(Validaciones!B166=\"\",\"\",Validaciones!B166)","v":"Programa de gestión de riesgo químico y sistema globalmente armonizado "},{"$f":"+IF(Validaciones!C166=\"\",\"\",Validaciones!C166)","v":"Personal responsable del sistema de gestión de seguridad y salud en el trabajo y/o personal de compras - producción "},{"$f":"+IF(Validaciones!D166=\"\",\"\",Validaciones!D166)","v":"PRESENCIAL "},{"$f":"+IF(Validaciones!E166=\"\",\"\",Validaciones!E166)","v":"MEDELLÍN "},{"$f":"+IF(Validaciones!F166=\"\",\"\",Validaciones!F166)","v":"2019-04-24"},{"$f":"+IF(Validaciones!G166=\"\",\"\",Validaciones!G166)","v":"8:00 a.m. - 12:00 m"},{"$f":"+IF(Validaciones!H166=\"\",\"\",Validaciones!H166)","v":"Carrera 43A No 19-17, auditorio piso 4 torre norte Block Empresarial"},{"$f":"+IF(Validaciones!I166=\"\",\"\",Validaciones!I166)","v":4},null,{"$f":"+IF(Validaciones!I168=\"\",\"\",Validaciones!I168)","v":4},{"$f":"IF(B172=\"\",\"\",+VLOOKUP(B172,'PRESENCIAL NACIONAL - VIRTUALES'!C:N,12,0))","v":"Gestión Interriesgos"}]
[{"$f":"+IF(Validaciones!A167=\"\",\"\",Validaciones!A167)","v":"PROGRAMA DE GESTIÓN RIESGO QUÍMICO"},{"$f":"+IF(Validaciones!B167=\"\",\"\",Validaciones!B167)","v":"Programa de gestión de riesgo químico y sistema globalmente armonizado "},{"$f":"+IF(Validaciones!C167=\"\",\"\",Validaciones!C167)","v":"Personal responsable del sistema de gestión de seguridad y salud en el trabajo y/o personal de compras - producción "},{"$f":"+IF(Validaciones!D167=\"\",\"\",Validaciones!D167)","v":"VIRTUAL "},{"$f":"+IF(Validaciones!E167=\"\",\"\",Validaciones!E167)","v":"NACIONAL"},{"$f":"+IF(Validaciones!F167=\"\",\"\",Validaciones!F167)","v":"2019-03-01"},{"$f":"+IF(Validaciones!G167=\"\",\"\",Validaciones!G167)","v":"2:00 p.m. - 5:00 p.m."},{"$f":"+IF(Validaciones!H167=\"\",\"\",Validaciones!H167)","v":"Liberty University"},{"$f":"+IF(Validaciones!I167=\"\",\"\",Validaciones!I167)","v":200},null,{"$f":"+IF(Validaciones!I169=\"\",\"\",Validaciones!I169)","v":200},{"$f":"IF(B173=\"\",\"\",+VLOOKUP(B173,'PRESENCIAL NACIONAL - VIRTUALES'!C:N,12,0))","v":"Gestión Interriesgos"}]
[{"$f":"+IF(Validaciones!A168=\"\",\"\",Validaciones!A168)","v":"RIESGO PSICOSOCIAL "},{"$f":"+IF(Validaciones!B168=\"\",\"\",Validaciones!B168)","v":"Programa de gestión riesgo psicosocial "},{"$f":"+IF(Validaciones!C168=\"\",\"\",Validaciones!C168)","v":"Personal responsable del sistema de gestión, Talento humano y comité de convivencia. "},{"$f":"+IF(Validaciones!D168=\"\",\"\",Validaciones!D168)","v":"PRESENCIAL "},{"$f":"+IF(Validaciones!E168=\"\",\"\",Validaciones!E168)","v":"MEDELLÍN "},{"$f":"+IF(Validaciones!F168=\"\",\"\",Validaciones!F168)","v":"2019-06-07"},{"$f":"+IF(Validaciones!G168=\"\",\"\",Validaciones!G168)","v":"8:00 am - 10:00 a.m."},{"$f":"+IF(Validaciones!H168=\"\",\"\",Validaciones!H168)","v":"Carrera 43A No 19-17, auditorio piso 4 torre norte Block Empresarial"},{"$f":"+IF(Validaciones!I168=\"\",\"\",Validaciones!I168)","v":4},null,{"$f":"+IF(Validaciones!I170=\"\",\"\",Validaciones!I170)","v":200},{"$f":"IF(B174=\"\",\"\",+VLOOKUP(B174,'PRESENCIAL NACIONAL - VIRTUALES'!C:N,12,0))","v":"RIGS SAS  "}]
[{"$f":"+IF(Validaciones!A169=\"\",\"\",Validaciones!A169)","v":"RIESGO PSICOSOCIAL "},{"$f":"+IF(Validaciones!B169=\"\",\"\",Validaciones!B169)","v":"Programa de gestión riesgo psicosocial (Aula viviendo en armonía)."},{"$f":"+IF(Validaciones!C169=\"\",\"\",Validaciones!C169)","v":"Personal responsable del sistema de gestión, Talento humano y comité de convivencia. "},{"$f":"+IF(Validaciones!D169=\"\",\"\",Validaciones!D169)","v":"VIRTUAL "},{"$f":"+IF(Validaciones!E169=\"\",\"\",Validaciones!E169)","v":"NACIONAL"},{"$f":"+IF(Validaciones!F169=\"\",\"\",Validaciones!F169)","v":"2019-10-31"},{"$f":"+IF(Validaciones!G169=\"\",\"\",Validaciones!G169)","v":"Abierto"},{"$f":"+IF(Validaciones!H169=\"\",\"\",Validaciones!H169)","v":"Liberty University"},{"$f":"+IF(Validaciones!I169=\"\",\"\",Validaciones!I169)","v":200},null,{"$f":"+IF(Validaciones!I171=\"\",\"\",Validaciones!I171)","v":200},{"$f":"IF(B175=\"\",\"\",+VLOOKUP(B175,'PRESENCIAL NACIONAL - VIRTUALES'!C:N,12,0))","v":0}]
[{"$f":"+IF(Validaciones!A170=\"\",\"\",Validaciones!A170)","v":"RIESGO PSICOSOCIAL "},{"$f":"+IF(Validaciones!B170=\"\",\"\",Validaciones!B170)","v":"Familia saludable, trabajador sano. (Aula viviendo en armonía)."},{"$f":"+IF(Validaciones!C170=\"\",\"\",Validaciones!C170)","v":"Trabajadores afiliados a Liberty"},{"$f":"+IF(Validaciones!D170=\"\",\"\",Validaciones!D170)","v":"VIRTUAL "},{"$f":"+IF(Validaciones!E170=\"\",\"\",Validaciones!E170)","v":"NACIONAL"},{"$f":"+IF(Validaciones!F170=\"\",\"\",Validaciones!F170)","v":"2019-10-31"},{"$f":"+IF(Validaciones!G170=\"\",\"\",Validaciones!G170)","v":"Abierto"},{"$f":"+IF(Validaciones!H170=\"\",\"\",Validaciones!H170)","v":"Liberty University"},{"$f":"+IF(Validaciones!I170=\"\",\"\",Validaciones!I170)","v":200},null,{"$f":"+IF(Validaciones!I172=\"\",\"\",Validaciones!I172)","v":200},{"$f":"IF(B176=\"\",\"\",+VLOOKUP(B176,'PRESENCIAL NACIONAL - VIRTUALES'!C:N,12,0))","v":0}]
[{"$f":"+IF(Validaciones!A171=\"\",\"\",Validaciones!A171)","v":"RIESGO PSICOSOCIAL "},{"$f":"+IF(Validaciones!B171=\"\",\"\",Validaciones!B171)","v":"Manejo de emociones y salud integral"},{"$f":"+IF(Validaciones!C171=\"\",\"\",Validaciones!C171)","v":"Trabajadores afiliados a Liberty"},{"$f":"+IF(Validaciones!D171=\"\",\"\",Validaciones!D171)","v":"VIRTUAL "},{"$f":"+IF(Validaciones!E171=\"\",\"\",Validaciones!E171)","v":"NACIONAL"},{"$f":"+IF(Validaciones!F171=\"\",\"\",Validaciones!F171)","v":"2019-10-29"},{"$f":"+IF(Validaciones!G171=\"\",\"\",Validaciones!G171)","v":"2:30 p.m. - 4:30 p.m."},{"$f":"+IF(Validaciones!H171=\"\",\"\",Validaciones!H171)","v":"Liberty University"},{"$f":"+IF(Validaciones!I171=\"\",\"\",Validaciones!I171)","v":200},null,{"$f":"+IF(Validaciones!I173=\"\",\"\",Validaciones!I173)","v":2},{"$f":"IF(B177=\"\",\"\",+VLOOKUP(B177,'PRESENCIAL NACIONAL - VIRTUALES'!C:N,12,0))","v":0}]
[{"$f":"+IF(Validaciones!A172=\"\",\"\",Validaciones!A172)","v":"SISTEMA DE GESTIÓN SEGURIDAD Y SALUD EN EL TRABAJO SST"},{"$f":"+IF(Validaciones!B172=\"\",\"\",Validaciones!B172)","v":"Curso 50 Horas Sistema de gestión de seguridad y salud en el trabajo "},{"$f":"+IF(Validaciones!C172=\"\",\"\",Validaciones!C172)","v":"Responsable del sistema de gestión, copasst y todas los cargos que rinden cuentas en el sistema de gestión de seguridad y salud en el trabajo)."},{"$f":"+IF(Validaciones!D172=\"\",\"\",Validaciones!D172)","v":"VIRTUAL "},{"$f":"+IF(Validaciones!E172=\"\",\"\",Validaciones!E172)","v":"NACIONAL"},{"$f":"+IF(Validaciones!F172=\"\",\"\",Validaciones!F172)","v":"2019-10-31"},{"$f":"+IF(Validaciones!G172=\"\",\"\",Validaciones!G172)","v":"Abierto "},{"$f":"+IF(Validaciones!H172=\"\",\"\",Validaciones!H172)","v":"Liberty University"},{"$f":"+IF(Validaciones!I172=\"\",\"\",Validaciones!I172)","v":200},null,{"$f":"+IF(Validaciones!I174=\"\",\"\",Validaciones!I174)","v":2},{"$f":"IF(B178=\"\",\"\",+VLOOKUP(B178,'PRESENCIAL NACIONAL - VIRTUALES'!C:N,12,0))","v":0}]
[{"$f":"+IF(Validaciones!A173=\"\",\"\",Validaciones!A173)","v":"SISTEMA DE GESTIÓN SEGURIDAD Y SALUD EN EL TRABAJO SST"},{"$f":"+IF(Validaciones!B173=\"\",\"\",Validaciones!B173)","v":"Sistema de gestion de seguridad y salud en el trabajo, enfocado hacia el plan de trabajo y fase de verificación del ministerio de trabajo.  "},{"$f":"+IF(Validaciones!C173=\"\",\"\",Validaciones!C173)","v":"Responsable del sistema de gestión, copasst y todas los cargos que rinden cuentas en el sistema de gestión de seguridad y salud en el trabajo)."},{"$f":"+IF(Validaciones!D173=\"\",\"\",Validaciones!D173)","v":"PRESENCIAL "},{"$f":"+IF(Validaciones!E173=\"\",\"\",Validaciones!E173)","v":"PEREIRA"},{"$f":"+IF(Validaciones!F173=\"\",\"\",Validaciones!F173)","v":"2019-03-07"},{"$f":"+IF(Validaciones!G173=\"\",\"\",Validaciones!G173)","v":"8:00 a.m. - 12:00 m"},{"$f":"+IF(Validaciones!H173=\"\",\"\",Validaciones!H173)","v":"Previo a la actividad se estará confirmando lugar del evento "},{"$f":"+IF(Validaciones!I173=\"\",\"\",Validaciones!I173)","v":2},null,{"$f":"+IF(Validaciones!I175=\"\",\"\",Validaciones!I175)","v":2},{"$f":"IF(B179=\"\",\"\",+VLOOKUP(B179,'PRESENCIAL NACIONAL - VIRTUALES'!C:N,12,0))","v":0}]
[{"$f":"+IF(Validaciones!A174=\"\",\"\",Validaciones!A174)","v":"SISTEMA DE GESTIÓN SEGURIDAD Y SALUD EN EL TRABAJO SST"},{"$f":"+IF(Validaciones!B174=\"\",\"\",Validaciones!B174)","v":"Sistema de gestion de seguridad y salud en el trabajo, enfocado hacia el plan de trabajo y fase de verificación del ministerio de trabajo.  "},{"$f":"+IF(Validaciones!C174=\"\",\"\",Validaciones!C174)","v":"Responsable del sistema de gestión, copasst y todas los cargos que rinden cuentas en el sistema de gestión de seguridad y salud en el trabajo)."},{"$f":"+IF(Validaciones!D174=\"\",\"\",Validaciones!D174)","v":"PRESENCIAL "},{"$f":"+IF(Validaciones!E174=\"\",\"\",Validaciones!E174)","v":"TUNJA"},{"$f":"+IF(Validaciones!F174=\"\",\"\",Validaciones!F174)","v":"2019-03-07"},{"$f":"+IF(Validaciones!G174=\"\",\"\",Validaciones!G174)","v":"8:00 a.m. - 12:00 m"},{"$f":"+IF(Validaciones!H174=\"\",\"\",Validaciones!H174)","v":"Previo a la actividad se estará confirmando lugar del evento "},{"$f":"+IF(Validaciones!I174=\"\",\"\",Validaciones!I174)","v":2},null,{"$f":"+IF(Validaciones!I176=\"\",\"\",Validaciones!I176)","v":2},{"$f":"IF(B180=\"\",\"\",+VLOOKUP(B180,'PRESENCIAL NACIONAL - VIRTUALES'!C:N,12,0))","v":0}]
[{"$f":"+IF(Validaciones!A175=\"\",\"\",Validaciones!A175)","v":"SISTEMA DE GESTIÓN SEGURIDAD Y SALUD EN EL TRABAJO SST"},{"$f":"+IF(Validaciones!B175=\"\",\"\",Validaciones!B175)","v":"Sistema de gestion de seguridad y salud en el trabajo, enfocado hacia el plan de trabajo y fase de verificación del ministerio de trabajo.  "},{"$f":"+IF(Validaciones!C175=\"\",\"\",Validaciones!C175)","v":"Responsable del sistema de gestión, copasst y todas los cargos que rinden cuentas en el sistema de gestión de seguridad y salud en el trabajo)."},{"$f":"+IF(Validaciones!D175=\"\",\"\",Validaciones!D175)","v":"PRESENCIAL "},{"$f":"+IF(Validaciones!E175=\"\",\"\",Validaciones!E175)","v":"VILLAVICENCIO"},{"$f":"+IF(Validaciones!F175=\"\",\"\",Validaciones!F175)","v":"2019-03-07"},{"$f":"+IF(Validaciones!G175=\"\",\"\",Validaciones!G175)","v":"8:00 a.m. - 12:00 m"},{"$f":"+IF(Validaciones!H175=\"\",\"\",Validaciones!H175)","v":"Previo a la actividad se estará confirmando lugar del evento "},{"$f":"+IF(Validaciones!I175=\"\",\"\",Validaciones!I175)","v":2},null,{"$f":"+IF(Validaciones!I177=\"\",\"\",Validaciones!I177)","v":3},{"$f":"IF(B181=\"\",\"\",+VLOOKUP(B181,'PRESENCIAL NACIONAL - VIRTUALES'!C:N,12,0))","v":0}]
[{"$f":"+IF(Validaciones!A176=\"\",\"\",Validaciones!A176)","v":"SISTEMA DE GESTIÓN SEGURIDAD Y SALUD EN EL TRABAJO SST"},{"$f":"+IF(Validaciones!B176=\"\",\"\",Validaciones!B176)","v":"Sistema de gestion de seguridad y salud en el trabajo, enfocado hacia el plan de trabajo y fase de verificación del ministerio de trabajo.  "},{"$f":"+IF(Validaciones!C176=\"\",\"\",Validaciones!C176)","v":"Responsable del sistema de gestión, copasst y todas los cargos que rinden cuentas en el sistema de gestión de seguridad y salud en el trabajo)."},{"$f":"+IF(Validaciones!D176=\"\",\"\",Validaciones!D176)","v":"PRESENCIAL "},{"$f":"+IF(Validaciones!E176=\"\",\"\",Validaciones!E176)","v":"SOGAMOSO "},{"$f":"+IF(Validaciones!F176=\"\",\"\",Validaciones!F176)","v":"2019-03-07"},{"$f":"+IF(Validaciones!G176=\"\",\"\",Validaciones!G176)","v":"8:00 a.m. - 12:00 m"},{"$f":"+IF(Validaciones!H176=\"\",\"\",Validaciones!H176)","v":"Previo a la actividad se estará confirmando lugar del evento "},{"$f":"+IF(Validaciones!I176=\"\",\"\",Validaciones!I176)","v":2},null,{"$f":"+IF(Validaciones!I178=\"\",\"\",Validaciones!I178)","v":2},{"$f":"IF(B182=\"\",\"\",+VLOOKUP(B182,'PRESENCIAL NACIONAL - VIRTUALES'!C:N,12,0))","v":0}]
[{"$f":"+IF(Validaciones!A177=\"\",\"\",Validaciones!A177)","v":"SISTEMA DE GESTIÓN SEGURIDAD Y SALUD EN EL TRABAJO SST"},{"$f":"+IF(Validaciones!B177=\"\",\"\",Validaciones!B177)","v":"Curso certificado sistema de gestión.  En qué fase está mi empresa con respecto al cumplimiento de las fases dadas por el ministerio?. Modulo 1 . Evaluación estándares mínimos y componentes del SG - SST y Fase Planear. "},{"$f":"+IF(Validaciones!C177=\"\",\"\",Validaciones!C177)","v":"Responsable del sistema de gestión, copasst y todas los cargos que rinden cuentas en el sistema de gestión de seguridad y salud en el trabajo)."},{"$f":"+IF(Validaciones!D177=\"\",\"\",Validaciones!D177)","v":"PRESENCIAL "},{"$f":"+IF(Validaciones!E177=\"\",\"\",Validaciones!E177)","v":"BARRANQUILLA"},{"$f":"+IF(Validaciones!F177=\"\",\"\",Validaciones!F177)","v":"2019-03-28"},{"$f":"+IF(Validaciones!G177=\"\",\"\",Validaciones!G177)","v":"8:00 a.m. - 12:00 m"},{"$f":"+IF(Validaciones!H177=\"\",\"\",Validaciones!H177)","v":"Liberty Seguros Calle 77 No 59-35 Barranquilla"},{"$f":"+IF(Validaciones!I177=\"\",\"\",Validaciones!I177)","v":3},null,{"$f":"+IF(Validaciones!I179=\"\",\"\",Validaciones!I179)","v":2},{"$f":"IF(B183=\"\",\"\",+VLOOKUP(B183,'PRESENCIAL NACIONAL - VIRTUALES'!C:N,12,0))","v":"Montajes y procesos mgonzalez@montajesyprocesos.com"}]
[{"$f":"+IF(Validaciones!A178=\"\",\"\",Validaciones!A178)","v":"SISTEMA DE GESTIÓN SEGURIDAD Y SALUD EN EL TRABAJO SST"},{"$f":"+IF(Validaciones!B178=\"\",\"\",Validaciones!B178)","v":"Curso certificado sistema de gestión.  En qué fase está mi empresa con respecto al cumplimiento de las fases dadas por el ministerio?. Modulo 1 . Evaluación estándares mínimos y componentes del SG - SST y Fase Planear. "},{"$f":"+IF(Validaciones!C178=\"\",\"\",Validaciones!C178)","v":"Responsable del sistema de gestión, copasst y todas los cargos que rinden cuentas en el sistema de gestión de seguridad y salud en el trabajo)."},{"$f":"+IF(Validaciones!D178=\"\",\"\",Validaciones!D178)","v":"PRESENCIAL "},{"$f":"+IF(Validaciones!E178=\"\",\"\",Validaciones!E178)","v":"BUCARAMANGA"},{"$f":"+IF(Validaciones!F178=\"\",\"\",Validaciones!F178)","v":"2019-02-21"},{"$f":"+IF(Validaciones!G178=\"\",\"\",Validaciones!G178)","v":"8:00 a.m. - 12:00 m"},{"$f":"+IF(Validaciones!H178=\"\",\"\",Validaciones!H178)","v":"Hotel La Triada Cra. 20 #34--22"},{"$f":"+IF(Validaciones!I178=\"\",\"\",Validaciones!I178)","v":2},null,{"$f":"+IF(Validaciones!I180=\"\",\"\",Validaciones!I180)","v":2},{"$f":"IF(B184=\"\",\"\",+VLOOKUP(B184,'PRESENCIAL NACIONAL - VIRTUALES'!C:N,12,0))","v":"Montajes y procesos mgonzalez@montajesyprocesos.com"}]
[{"$f":"+IF(Validaciones!A179=\"\",\"\",Validaciones!A179)","v":"SISTEMA DE GESTIÓN SEGURIDAD Y SALUD EN EL TRABAJO SST"},{"$f":"+IF(Validaciones!B179=\"\",\"\",Validaciones!B179)","v":"Curso certificado sistema de gestión.  En qué fase está mi empresa con respecto al cumplimiento de las fases dadas por el ministerio?. Modulo 1 . Evaluación estándares mínimos y componentes del SG - SST y Fase Planear. "},{"$f":"+IF(Validaciones!C179=\"\",\"\",Validaciones!C179)","v":"Responsable del sistema de gestión, copasst y todas los cargos que rinden cuentas en el sistema de gestión de seguridad y salud en el trabajo)."},{"$f":"+IF(Validaciones!D179=\"\",\"\",Validaciones!D179)","v":"PRESENCIAL "},{"$f":"+IF(Validaciones!E179=\"\",\"\",Validaciones!E179)","v":"CALI"},{"$f":"+IF(Validaciones!F179=\"\",\"\",Validaciones!F179)","v":"2019-03-20"},{"$f":"+IF(Validaciones!G179=\"\",\"\",Validaciones!G179)","v":"8:00 a.m. - 12:00 m"},{"$f":"+IF(Validaciones!H179=\"\",\"\",Validaciones!H179)","v":"Av. 5 Norte # 38N-81"},{"$f":"+IF(Validaciones!I179=\"\",\"\",Validaciones!I179)","v":2},null,{"$f":"+IF(Validaciones!I181=\"\",\"\",Validaciones!I181)","v":2},{"$f":"IF(B185=\"\",\"\",+VLOOKUP(B185,'PRESENCIAL NACIONAL - VIRTUALES'!C:N,12,0))","v":"Montajes y procesos mgonzalez@montajesyprocesos.com"}]
[{"$f":"+IF(Validaciones!A180=\"\",\"\",Validaciones!A180)","v":"SISTEMA DE GESTIÓN SEGURIDAD Y SALUD EN EL TRABAJO SST"},{"$f":"+IF(Validaciones!B180=\"\",\"\",Validaciones!B180)","v":"Curso certificado sistema de gestión.  En qué fase está mi empresa con respecto al cumplimiento de las fases dadas por el ministerio?. Modulo 1 . Evaluación estándares mínimos y componentes del SG - SST y Fase Planear. "},{"$f":"+IF(Validaciones!C180=\"\",\"\",Validaciones!C180)","v":"Responsable del sistema de gestión, copasst y todas los cargos que rinden cuentas en el sistema de gestión de seguridad y salud en el trabajo)."},{"$f":"+IF(Validaciones!D180=\"\",\"\",Validaciones!D180)","v":"PRESENCIAL "},{"$f":"+IF(Validaciones!E180=\"\",\"\",Validaciones!E180)","v":"CARTAGENA"},{"$f":"+IF(Validaciones!F180=\"\",\"\",Validaciones!F180)","v":"2019-02-07"},{"$f":"+IF(Validaciones!G180=\"\",\"\",Validaciones!G180)","v":"8:00 a.m. - 12:00 m"},{"$f":"+IF(Validaciones!H180=\"\",\"\",Validaciones!H180)","v":"Liberty Seguros, Calle del Arsenal No 8B-195 piso 1"},{"$f":"+IF(Validaciones!I180=\"\",\"\",Validaciones!I180)","v":2},null,{"$f":"+IF(Validaciones!I182=\"\",\"\",Validaciones!I182)","v":2},{"$f":"IF(B186=\"\",\"\",+VLOOKUP(B186,'PRESENCIAL NACIONAL - VIRTUALES'!C:N,12,0))","v":"Montajes y procesos mgonzalez@montajesyprocesos.com"}]
[{"$f":"+IF(Validaciones!A181=\"\",\"\",Validaciones!A181)","v":"SISTEMA DE GESTIÓN SEGURIDAD Y SALUD EN EL TRABAJO SST"},{"$f":"+IF(Validaciones!B181=\"\",\"\",Validaciones!B181)","v":"Curso certificado sistema de gestión.  En qué fase está mi empresa con respecto al cumplimiento de las fases dadas por el ministerio?. Modulo 1 . Evaluación estándares mínimos y componentes del SG - SST y Fase Planear. "},{"$f":"+IF(Validaciones!C181=\"\",\"\",Validaciones!C181)","v":"Responsable del sistema de gestión, copasst y todas los cargos que rinden cuentas en el sistema de gestión de seguridad y salud en el trabajo)."},{"$f":"+IF(Validaciones!D181=\"\",\"\",Validaciones!D181)","v":"PRESENCIAL "},{"$f":"+IF(Validaciones!E181=\"\",\"\",Validaciones!E181)","v":"BOGOTÁ"},{"$f":"+IF(Validaciones!F181=\"\",\"\",Validaciones!F181)","v":"2019-02-07"},{"$f":"+IF(Validaciones!G181=\"\",\"\",Validaciones!G181)","v":"8:00 a.m. - 12:00 m"},{"$f":"+IF(Validaciones!H181=\"\",\"\",Validaciones!H181)","v":"Calle 73 N° 10 - 83 Torre C Oficina 302. Salón 302 Fucsia"},{"$f":"+IF(Validaciones!I181=\"\",\"\",Validaciones!I181)","v":2},null,{"$f":"+IF(Validaciones!I183=\"\",\"\",Validaciones!I183)","v":4},{"$f":"IF(B187=\"\",\"\",+VLOOKUP(B187,'PRESENCIAL NACIONAL - VIRTUALES'!C:N,12,0))","v":"Montajes y procesos mgonzalez@montajesyprocesos.com"}]
[{"$f":"+IF(Validaciones!A182=\"\",\"\",Validaciones!A182)","v":"SISTEMA DE GESTIÓN SEGURIDAD Y SALUD EN EL TRABAJO SST"},{"$f":"+IF(Validaciones!B182=\"\",\"\",Validaciones!B182)","v":"Curso certificado sistema de gestión.  En qué fase está mi empresa con respecto al cumplimiento de las fases dadas por el ministerio?. Modulo 1 . Evaluación estándares mínimos y componentes del SG - SST y Fase Planear. "},{"$f":"+IF(Validaciones!C182=\"\",\"\",Validaciones!C182)","v":"Responsable del sistema de gestión, copasst y todas los cargos que rinden cuentas en el sistema de gestión de seguridad y salud en el trabajo)."},{"$f":"+IF(Validaciones!D182=\"\",\"\",Validaciones!D182)","v":"PRESENCIAL "},{"$f":"+IF(Validaciones!E182=\"\",\"\",Validaciones!E182)","v":"BOGOTÁ"},{"$f":"+IF(Validaciones!F182=\"\",\"\",Validaciones!F182)","v":"2019-07-04"},{"$f":"+IF(Validaciones!G182=\"\",\"\",Validaciones!G182)","v":"8:00 a.m. - 12:00 m"},{"$f":"+IF(Validaciones!H182=\"\",\"\",Validaciones!H182)","v":"Calle 73 N° 10 - 83 Torre C Oficina 302. Salón 302 Fucsia"},{"$f":"+IF(Validaciones!I182=\"\",\"\",Validaciones!I182)","v":2},null,{"$f":"+IF(Validaciones!I184=\"\",\"\",Validaciones!I184)","v":3},{"$f":"IF(B188=\"\",\"\",+VLOOKUP(B188,'PRESENCIAL NACIONAL - VIRTUALES'!C:N,12,0))","v":"Montajes y procesos mgonzalez@montajesyprocesos.com"}]
[{"$f":"+IF(Validaciones!A183=\"\",\"\",Validaciones!A183)","v":"SISTEMA DE GESTIÓN SEGURIDAD Y SALUD EN EL TRABAJO SST"},{"$f":"+IF(Validaciones!B183=\"\",\"\",Validaciones!B183)","v":"Curso certificado sistema de gestión.  En qué fase está mi empresa con respecto al cumplimiento de las fases dadas por el ministerio?. Modulo 1 . Evaluación estándares mínimos y componentes del SG - SST y Fase Planear. "},{"$f":"+IF(Validaciones!C183=\"\",\"\",Validaciones!C183)","v":"Responsable del sistema de gestión, copasst y todas los cargos que rinden cuentas en el sistema de gestión de seguridad y salud en el trabajo)."},{"$f":"+IF(Validaciones!D183=\"\",\"\",Validaciones!D183)","v":"PRESENCIAL "},{"$f":"+IF(Validaciones!E183=\"\",\"\",Validaciones!E183)","v":"MEDELLÍN "},{"$f":"+IF(Validaciones!F183=\"\",\"\",Validaciones!F183)","v":"2019-03-06"},{"$f":"+IF(Validaciones!G183=\"\",\"\",Validaciones!G183)","v":"8:00 a.m. - 12:00 m"},{"$f":"+IF(Validaciones!H183=\"\",\"\",Validaciones!H183)","v":"Carrera 43A No 19-17, auditorio piso 4 torre norte Block Empresarial"},{"$f":"+IF(Validaciones!I183=\"\",\"\",Validaciones!I183)","v":4},null,{"$f":"+IF(Validaciones!I185=\"\",\"\",Validaciones!I185)","v":2},{"$f":"IF(B189=\"\",\"\",+VLOOKUP(B189,'PRESENCIAL NACIONAL - VIRTUALES'!C:N,12,0))","v":"Montajes y procesos mgonzalez@montajesyprocesos.com"}]
[{"$f":"+IF(Validaciones!A184=\"\",\"\",Validaciones!A184)","v":"SISTEMA DE GESTIÓN SEGURIDAD Y SALUD EN EL TRABAJO SST"},{"$f":"+IF(Validaciones!B184=\"\",\"\",Validaciones!B184)","v":"Curso certificado sistema de gestión.  En qué fase está mi empresa con respecto al cumplimiento de las fases dadas por el ministerio?. Modulo 2 . Fase Hacer y  Verificar. Requisito módulo 1."},{"$f":"+IF(Validaciones!C184=\"\",\"\",Validaciones!C184)","v":"Responsable del sistema de gestión, copasst y todas los cargos que rinden cuentas en el sistema de gestión de seguridad y salud en el trabajo)."},{"$f":"+IF(Validaciones!D184=\"\",\"\",Validaciones!D184)","v":"PRESENCIAL "},{"$f":"+IF(Validaciones!E184=\"\",\"\",Validaciones!E184)","v":"BARRANQUILLA"},{"$f":"+IF(Validaciones!F184=\"\",\"\",Validaciones!F184)","v":"2019-04-11"},{"$f":"+IF(Validaciones!G184=\"\",\"\",Validaciones!G184)","v":"8:00 a.m. - 12:00 m"},{"$f":"+IF(Validaciones!H184=\"\",\"\",Validaciones!H184)","v":"ICONTEC Cra 57 No. 70-89 Barranquilla"},{"$f":"+IF(Validaciones!I184=\"\",\"\",Validaciones!I184)","v":3},null,{"$f":"+IF(Validaciones!I186=\"\",\"\",Validaciones!I186)","v":2},{"$f":"IF(B190=\"\",\"\",+VLOOKUP(B190,'PRESENCIAL NACIONAL - VIRTUALES'!C:N,12,0))","v":0}]
[{"$f":"+IF(Validaciones!A185=\"\",\"\",Validaciones!A185)","v":"SISTEMA DE GESTIÓN SEGURIDAD Y SALUD EN EL TRABAJO SST"},{"$f":"+IF(Validaciones!B185=\"\",\"\",Validaciones!B185)","v":"Curso certificado sistema de gestión.  En qué fase está mi empresa con respecto al cumplimiento de las fases dadas por el ministerio?. Modulo 2 . Fase Hacer y  Verificar. Requisito módulo 1."},{"$f":"+IF(Validaciones!C185=\"\",\"\",Validaciones!C185)","v":"Responsable del sistema de gestión, copasst y todas los cargos que rinden cuentas en el sistema de gestión de seguridad y salud en el trabajo)."},{"$f":"+IF(Validaciones!D185=\"\",\"\",Validaciones!D185)","v":"PRESENCIAL "},{"$f":"+IF(Validaciones!E185=\"\",\"\",Validaciones!E185)","v":"BUCARAMANGA"},{"$f":"+IF(Validaciones!F185=\"\",\"\",Validaciones!F185)","v":"2019-03-14"},{"$f":"+IF(Validaciones!G185=\"\",\"\",Validaciones!G185)","v":"8:00 a.m. - 12:00 m"},{"$f":"+IF(Validaciones!H185=\"\",\"\",Validaciones!H185)","v":"Hotel La Triada Cra. 20 #34--22"},{"$f":"+IF(Validaciones!I185=\"\",\"\",Validaciones!I185)","v":2},null,{"$f":"+IF(Validaciones!I187=\"\",\"\",Validaciones!I187)","v":2},{"$f":"IF(B191=\"\",\"\",+VLOOKUP(B191,'PRESENCIAL NACIONAL - VIRTUALES'!C:N,12,0))","v":0}]
[{"$f":"+IF(Validaciones!A186=\"\",\"\",Validaciones!A186)","v":"SISTEMA DE GESTIÓN SEGURIDAD Y SALUD EN EL TRABAJO SST"},{"$f":"+IF(Validaciones!B186=\"\",\"\",Validaciones!B186)","v":"Curso certificado sistema de gestión.  En qué fase está mi empresa con respecto al cumplimiento de las fases dadas por el ministerio?. Modulo 2 . Fase Hacer y  Verificar. Requisito módulo 1."},{"$f":"+IF(Validaciones!C186=\"\",\"\",Validaciones!C186)","v":"Responsable del sistema de gestión, copasst y todas los cargos que rinden cuentas en el sistema de gestión de seguridad y salud en el trabajo)."},{"$f":"+IF(Validaciones!D186=\"\",\"\",Validaciones!D186)","v":"PRESENCIAL "},{"$f":"+IF(Validaciones!E186=\"\",\"\",Validaciones!E186)","v":"CALI"},{"$f":"+IF(Validaciones!F186=\"\",\"\",Validaciones!F186)","v":"2019-03-28"},{"$f":"+IF(Validaciones!G186=\"\",\"\",Validaciones!G186)","v":"8:00 a.m. - 12:00 m"},{"$f":"+IF(Validaciones!H186=\"\",\"\",Validaciones!H186)","v":"Av. 5 Norte # 38N-81"},{"$f":"+IF(Validaciones!I186=\"\",\"\",Validaciones!I186)","v":2},null,{"$f":"+IF(Validaciones!I188=\"\",\"\",Validaciones!I188)","v":2},{"$f":"IF(B192=\"\",\"\",+VLOOKUP(B192,'PRESENCIAL NACIONAL - VIRTUALES'!C:N,12,0))","v":0}]
[{"$f":"+IF(Validaciones!A187=\"\",\"\",Validaciones!A187)","v":"SISTEMA DE GESTIÓN SEGURIDAD Y SALUD EN EL TRABAJO SST"},{"$f":"+IF(Validaciones!B187=\"\",\"\",Validaciones!B187)","v":"Curso certificado sistema de gestión.  En qué fase está mi empresa con respecto al cumplimiento de las fases dadas por el ministerio?. Modulo 2 . Fase Hacer y  Verificar. Requisito módulo 1."},{"$f":"+IF(Validaciones!C187=\"\",\"\",Validaciones!C187)","v":"Responsable del sistema de gestión, copasst y todas los cargos que rinden cuentas en el sistema de gestión de seguridad y salud en el trabajo)."},{"$f":"+IF(Validaciones!D187=\"\",\"\",Validaciones!D187)","v":"PRESENCIAL "},{"$f":"+IF(Validaciones!E187=\"\",\"\",Validaciones!E187)","v":"CARTAGENA"},{"$f":"+IF(Validaciones!F187=\"\",\"\",Validaciones!F187)","v":"2019-03-14"},{"$f":"+IF(Validaciones!G187=\"\",\"\",Validaciones!G187)","v":"8:00 a.m. - 12:00 m"},{"$f":"+IF(Validaciones!H187=\"\",\"\",Validaciones!H187)","v":"Liberty Seguros, Calle del Arsenal No 8B-195 piso 1"},{"$f":"+IF(Validaciones!I187=\"\",\"\",Validaciones!I187)","v":2},null,{"$f":"+IF(Validaciones!I189=\"\",\"\",Validaciones!I189)","v":2},{"$f":"IF(B193=\"\",\"\",+VLOOKUP(B193,'PRESENCIAL NACIONAL - VIRTUALES'!C:N,12,0))","v":0}]
[{"$f":"+IF(Validaciones!A188=\"\",\"\",Validaciones!A188)","v":"SISTEMA DE GESTIÓN SEGURIDAD Y SALUD EN EL TRABAJO SST"},{"$f":"+IF(Validaciones!B188=\"\",\"\",Validaciones!B188)","v":"Curso certificado sistema de gestión.  En qué fase está mi empresa con respecto al cumplimiento de las fases dadas por el ministerio?. Modulo 2 . Fase Hacer y  Verificar. Requisito módulo 1."},{"$f":"+IF(Validaciones!C188=\"\",\"\",Validaciones!C188)","v":"Responsable del sistema de gestión, copasst y todas los cargos que rinden cuentas en el sistema de gestión de seguridad y salud en el trabajo)."},{"$f":"+IF(Validaciones!D188=\"\",\"\",Validaciones!D188)","v":"PRESENCIAL "},{"$f":"+IF(Validaciones!E188=\"\",\"\",Validaciones!E188)","v":"BOGOTÁ"},{"$f":"+IF(Validaciones!F188=\"\",\"\",Validaciones!F188)","v":"2019-08-08"},{"$f":"+IF(Validaciones!G188=\"\",\"\",Validaciones!G188)","v":"8:00 a.m. - 12:00 m"},{"$f":"+IF(Validaciones!H188=\"\",\"\",Validaciones!H188)","v":"Calle 73 N° 10 - 83 Torre C Oficina 302. Salón 302 Fucsia"},{"$f":"+IF(Validaciones!I188=\"\",\"\",Validaciones!I188)","v":2},null,{"$f":"+IF(Validaciones!I190=\"\",\"\",Validaciones!I190)","v":4},{"$f":"IF(B194=\"\",\"\",+VLOOKUP(B194,'PRESENCIAL NACIONAL - VIRTUALES'!C:N,12,0))","v":0}]
[{"$f":"+IF(Validaciones!A189=\"\",\"\",Validaciones!A189)","v":"SISTEMA DE GESTIÓN SEGURIDAD Y SALUD EN EL TRABAJO SST"},{"$f":"+IF(Validaciones!B189=\"\",\"\",Validaciones!B189)","v":"Curso certificado sistema de gestión.  En qué fase está mi empresa con respecto al cumplimiento de las fases dadas por el ministerio?. Modulo 2 . Fase Hacer y  Verificar. Requisito módulo 1."},{"$f":"+IF(Validaciones!C189=\"\",\"\",Validaciones!C189)","v":"Responsable del sistema de gestión, copasst y todas los cargos que rinden cuentas en el sistema de gestión de seguridad y salud en el trabajo)."},{"$f":"+IF(Validaciones!D189=\"\",\"\",Validaciones!D189)","v":"PRESENCIAL "},{"$f":"+IF(Validaciones!E189=\"\",\"\",Validaciones!E189)","v":"BOGOTÁ"},{"$f":"+IF(Validaciones!F189=\"\",\"\",Validaciones!F189)","v":"2019-03-14"},{"$f":"+IF(Validaciones!G189=\"\",\"\",Validaciones!G189)","v":"8:00 a.m. - 12:00 m"},{"$f":"+IF(Validaciones!H189=\"\",\"\",Validaciones!H189)","v":"Calle 73 N° 10 - 83 Torre C Oficina 302. Salón 302 Fucsia"},{"$f":"+IF(Validaciones!I189=\"\",\"\",Validaciones!I189)","v":2},null,{"$f":"+IF(Validaciones!I191=\"\",\"\",Validaciones!I191)","v":3},{"$f":"IF(B195=\"\",\"\",+VLOOKUP(B195,'PRESENCIAL NACIONAL - VIRTUALES'!C:N,12,0))","v":0}]
[{"$f":"+IF(Validaciones!A190=\"\",\"\",Validaciones!A190)","v":"SISTEMA DE GESTIÓN SEGURIDAD Y SALUD EN EL TRABAJO SST"},{"$f":"+IF(Validaciones!B190=\"\",\"\",Validaciones!B190)","v":"Curso certificado sistema de gestión.  En qué fase está mi empresa con respecto al cumplimiento de las fases dadas por el ministerio?. Modulo 2 . Fase Hacer y  Verificar. Requisito módulo 1."},{"$f":"+IF(Validaciones!C190=\"\",\"\",Validaciones!C190)","v":"Responsable del sistema de gestión, copasst y todas los cargos que rinden cuentas en el sistema de gestión de seguridad y salud en el trabajo)."},{"$f":"+IF(Validaciones!D190=\"\",\"\",Validaciones!D190)","v":"PRESENCIAL "},{"$f":"+IF(Validaciones!E190=\"\",\"\",Validaciones!E190)","v":"MEDELLÍN "},{"$f":"+IF(Validaciones!F190=\"\",\"\",Validaciones!F190)","v":"2019-05-08"},{"$f":"+IF(Validaciones!G190=\"\",\"\",Validaciones!G190)","v":"8:00 a.m. - 12:00 m"},{"$f":"+IF(Validaciones!H190=\"\",\"\",Validaciones!H190)","v":"Carrera 43A No 19-17, auditorio piso 4 torre norte Block Empresarial"},{"$f":"+IF(Validaciones!I190=\"\",\"\",Validaciones!I190)","v":4},null,{"$f":"+IF(Validaciones!I192=\"\",\"\",Validaciones!I192)","v":2},{"$f":"IF(B196=\"\",\"\",+VLOOKUP(B196,'PRESENCIAL NACIONAL - VIRTUALES'!C:N,12,0))","v":0}]
[{"$f":"+IF(Validaciones!A191=\"\",\"\",Validaciones!A191)","v":"SISTEMA DE GESTIÓN SEGURIDAD Y SALUD EN EL TRABAJO SST"},{"$f":"+IF(Validaciones!B191=\"\",\"\",Validaciones!B191)","v":"Curso certificado sistema de gestión.  Fases estándares mínimos. En qué fase está mi empresa con respecto al cumplimiento de las fases dadas por el ministerio?. Modulo 3. Fase Actuar y seguimiento plan de mejora.  Requisito modulo 1 y 2."},{"$f":"+IF(Validaciones!C191=\"\",\"\",Validaciones!C191)","v":"Responsable del sistema de gestión, copasst y todas los cargos que rinden cuentas en el sistema de gestión de seguridad y salud en el trabajo)."},{"$f":"+IF(Validaciones!D191=\"\",\"\",Validaciones!D191)","v":"PRESENCIAL "},{"$f":"+IF(Validaciones!E191=\"\",\"\",Validaciones!E191)","v":"BARRANQUILLA"},{"$f":"+IF(Validaciones!F191=\"\",\"\",Validaciones!F191)","v":"2019-04-25"},{"$f":"+IF(Validaciones!G191=\"\",\"\",Validaciones!G191)","v":"8:00 a.m. - 12:00 m"},{"$f":"+IF(Validaciones!H191=\"\",\"\",Validaciones!H191)","v":"ICONTEC Cra 57 No. 70-89 Barranquilla"},{"$f":"+IF(Validaciones!I191=\"\",\"\",Validaciones!I191)","v":3},null,{"$f":"+IF(Validaciones!I193=\"\",\"\",Validaciones!I193)","v":2},{"$f":"IF(B197=\"\",\"\",+VLOOKUP(B197,'PRESENCIAL NACIONAL - VIRTUALES'!C:N,12,0))","v":0}]
[{"$f":"+IF(Validaciones!A192=\"\",\"\",Validaciones!A192)","v":"SISTEMA DE GESTIÓN SEGURIDAD Y SALUD EN EL TRABAJO SST"},{"$f":"+IF(Validaciones!B192=\"\",\"\",Validaciones!B192)","v":"Curso certificado sistema de gestión.  Fases estándares mínimos. En qué fase está mi empresa con respecto al cumplimiento de las fases dadas por el ministerio?. Modulo 3. Fase Actuar y seguimiento plan de mejora.  Requisito modulo 1 y 2."},{"$f":"+IF(Validaciones!C192=\"\",\"\",Validaciones!C192)","v":"Responsable del sistema de gestión, copasst y todas los cargos que rinden cuentas en el sistema de gestión de seguridad y salud en el trabajo)."},{"$f":"+IF(Validaciones!D192=\"\",\"\",Validaciones!D192)","v":"PRESENCIAL "},{"$f":"+IF(Validaciones!E192=\"\",\"\",Validaciones!E192)","v":"BUCARAMANGA"},{"$f":"+IF(Validaciones!F192=\"\",\"\",Validaciones!F192)","v":"2019-04-24"},{"$f":"+IF(Validaciones!G192=\"\",\"\",Validaciones!G192)","v":"8:00 a.m. - 12:00 m"},{"$f":"+IF(Validaciones!H192=\"\",\"\",Validaciones!H192)","v":"Hotel La Triada Cra. 20 #34--22"},{"$f":"+IF(Validaciones!I192=\"\",\"\",Validaciones!I192)","v":2},null,{"$f":"+IF(Validaciones!I194=\"\",\"\",Validaciones!I194)","v":2},{"$f":"IF(B198=\"\",\"\",+VLOOKUP(B198,'PRESENCIAL NACIONAL - VIRTUALES'!C:N,12,0))","v":0}]
[{"$f":"+IF(Validaciones!A193=\"\",\"\",Validaciones!A193)","v":"SISTEMA DE GESTIÓN SEGURIDAD Y SALUD EN EL TRABAJO SST"},{"$f":"+IF(Validaciones!B193=\"\",\"\",Validaciones!B193)","v":"Curso certificado sistema de gestión.  Fases estándares mínimos. En qué fase está mi empresa con respecto al cumplimiento de las fases dadas por el ministerio?. Modulo 3. Fase Actuar y seguimiento plan de mejora.  Requisito modulo 1 y 2."},{"$f":"+IF(Validaciones!C193=\"\",\"\",Validaciones!C193)","v":"Responsable del sistema de gestión, copasst y todas los cargos que rinden cuentas en el sistema de gestión de seguridad y salud en el trabajo)."},{"$f":"+IF(Validaciones!D193=\"\",\"\",Validaciones!D193)","v":"PRESENCIAL "},{"$f":"+IF(Validaciones!E193=\"\",\"\",Validaciones!E193)","v":"CALI"},{"$f":"+IF(Validaciones!F193=\"\",\"\",Validaciones!F193)","v":"2019-04-25"},{"$f":"+IF(Validaciones!G193=\"\",\"\",Validaciones!G193)","v":"8:00 a.m. - 12:00 m"},{"$f":"+IF(Validaciones!H193=\"\",\"\",Validaciones!H193)","v":"Av. 5 Norte # 38N-81"},{"$f":"+IF(Validaciones!I193=\"\",\"\",Validaciones!I193)","v":2},null,{"$f":"+IF(Validaciones!I195=\"\",\"\",Validaciones!I195)","v":2},{"$f":"IF(B199=\"\",\"\",+VLOOKUP(B199,'PRESENCIAL NACIONAL - VIRTUALES'!C:N,12,0))","v":0}]
[{"$f":"+IF(Validaciones!A194=\"\",\"\",Validaciones!A194)","v":"SISTEMA DE GESTIÓN SEGURIDAD Y SALUD EN EL TRABAJO SST"},{"$f":"+IF(Validaciones!B194=\"\",\"\",Validaciones!B194)","v":"Curso certificado sistema de gestión.  Fases estándares mínimos. En qué fase está mi empresa con respecto al cumplimiento de las fases dadas por el ministerio?. Modulo 3. Fase Actuar y seguimiento plan de mejora.  Requisito modulo 1 y 2."},{"$f":"+IF(Validaciones!C194=\"\",\"\",Validaciones!C194)","v":"Responsable del sistema de gestión, copasst y todas los cargos que rinden cuentas en el sistema de gestión de seguridad y salud en el trabajo)."},{"$f":"+IF(Validaciones!D194=\"\",\"\",Validaciones!D194)","v":"PRESENCIAL "},{"$f":"+IF(Validaciones!E194=\"\",\"\",Validaciones!E194)","v":"CARTAGENA"},{"$f":"+IF(Validaciones!F194=\"\",\"\",Validaciones!F194)","v":"2019-04-25"},{"$f":"+IF(Validaciones!G194=\"\",\"\",Validaciones!G194)","v":"8:00 a.m. - 12:00 m"},{"$f":"+IF(Validaciones!H194=\"\",\"\",Validaciones!H194)","v":"Liberty Seguros, Calle del Arsenal No 8B-195 piso 1"},{"$f":"+IF(Validaciones!I194=\"\",\"\",Validaciones!I194)","v":2},null,{"$f":"+IF(Validaciones!I196=\"\",\"\",Validaciones!I196)","v":2},{"$f":"IF(B200=\"\",\"\",+VLOOKUP(B200,'PRESENCIAL NACIONAL - VIRTUALES'!C:N,12,0))","v":0}]
[{"$f":"+IF(Validaciones!A195=\"\",\"\",Validaciones!A195)","v":"SISTEMA DE GESTIÓN SEGURIDAD Y SALUD EN EL TRABAJO SST"},{"$f":"+IF(Validaciones!B195=\"\",\"\",Validaciones!B195)","v":"Curso certificado sistema de gestión.  Fases estándares mínimos. En qué fase está mi empresa con respecto al cumplimiento de las fases dadas por el ministerio?. Modulo 3. Fase Actuar y seguimiento plan de mejora.  Requisito modulo 1 y 2."},{"$f":"+IF(Validaciones!C195=\"\",\"\",Validaciones!C195)","v":"Responsable del sistema de gestión, copasst y todas los cargos que rinden cuentas en el sistema de gestión de seguridad y salud en el trabajo)."},{"$f":"+IF(Validaciones!D195=\"\",\"\",Validaciones!D195)","v":"PRESENCIAL "},{"$f":"+IF(Validaciones!E195=\"\",\"\",Validaciones!E195)","v":"BOGOTÁ"},{"$f":"+IF(Validaciones!F195=\"\",\"\",Validaciones!F195)","v":"2019-09-12"},{"$f":"+IF(Validaciones!G195=\"\",\"\",Validaciones!G195)","v":"8:00 a.m. - 12:00 m"},{"$f":"+IF(Validaciones!H195=\"\",\"\",Validaciones!H195)","v":"Calle 73 N° 10 - 83 Torre C Oficina 302. Salón 302 Fucsia"},{"$f":"+IF(Validaciones!I195=\"\",\"\",Validaciones!I195)","v":2},null,{"$f":"+IF(Validaciones!I197=\"\",\"\",Validaciones!I197)","v":4},{"$f":"IF(B201=\"\",\"\",+VLOOKUP(B201,'PRESENCIAL NACIONAL - VIRTUALES'!C:N,12,0))","v":0}]
[{"$f":"+IF(Validaciones!A196=\"\",\"\",Validaciones!A196)","v":"SISTEMA DE GESTIÓN SEGURIDAD Y SALUD EN EL TRABAJO SST"},{"$f":"+IF(Validaciones!B196=\"\",\"\",Validaciones!B196)","v":"Curso certificado sistema de gestión.  Fases estándares mínimos. En qué fase está mi empresa con respecto al cumplimiento de las fases dadas por el ministerio?. Modulo 3. Fase Actuar y seguimiento plan de mejora.  Requisito modulo 1 y 2."},{"$f":"+IF(Validaciones!C196=\"\",\"\",Validaciones!C196)","v":"Responsable del sistema de gestión, copasst y todas los cargos que rinden cuentas en el sistema de gestión de seguridad y salud en el trabajo)."},{"$f":"+IF(Validaciones!D196=\"\",\"\",Validaciones!D196)","v":"PRESENCIAL "},{"$f":"+IF(Validaciones!E196=\"\",\"\",Validaciones!E196)","v":"BOGOTÁ"},{"$f":"+IF(Validaciones!F196=\"\",\"\",Validaciones!F196)","v":"2019-04-25"},{"$f":"+IF(Validaciones!G196=\"\",\"\",Validaciones!G196)","v":"8:00 a.m. - 12:00 m"},{"$f":"+IF(Validaciones!H196=\"\",\"\",Validaciones!H196)","v":"Calle 73 N° 10 - 83 Torre C Oficina 302. Salón 302 Fucsia"},{"$f":"+IF(Validaciones!I196=\"\",\"\",Validaciones!I196)","v":2},null,{"$f":"+IF(Validaciones!I198=\"\",\"\",Validaciones!I198)","v":2},{"$f":"IF(B202=\"\",\"\",+VLOOKUP(B202,'PRESENCIAL NACIONAL - VIRTUALES'!C:N,12,0))","v":0}]
[{"$f":"+IF(Validaciones!A197=\"\",\"\",Validaciones!A197)","v":"SISTEMA DE GESTIÓN SEGURIDAD Y SALUD EN EL TRABAJO SST"},{"$f":"+IF(Validaciones!B197=\"\",\"\",Validaciones!B197)","v":"Curso certificado sistema de gestión.  Fases estándares mínimos. En qué fase está mi empresa con respecto al cumplimiento de las fases dadas por el ministerio?. Modulo 3. Fase Actuar y seguimiento plan de mejora.  Requisito modulo 1 y 2."},{"$f":"+IF(Validaciones!C197=\"\",\"\",Validaciones!C197)","v":"Responsable del sistema de gestión, copasst y todas los cargos que rinden cuentas en el sistema de gestión de seguridad y salud en el trabajo)."},{"$f":"+IF(Validaciones!D197=\"\",\"\",Validaciones!D197)","v":"PRESENCIAL "},{"$f":"+IF(Validaciones!E197=\"\",\"\",Validaciones!E197)","v":"MEDELLÍN "},{"$f":"+IF(Validaciones!F197=\"\",\"\",Validaciones!F197)","v":"2019-06-18"},{"$f":"+IF(Validaciones!G197=\"\",\"\",Validaciones!G197)","v":"8:00 a.m. - 12:00 m"},{"$f":"+IF(Validaciones!H197=\"\",\"\",Validaciones!H197)","v":"Carrera 43A No 19-17, auditorio piso 4 torre norte Block Empresarial"},{"$f":"+IF(Validaciones!I197=\"\",\"\",Validaciones!I197)","v":4},null,{"$f":"+IF(Validaciones!I199=\"\",\"\",Validaciones!I199)","v":2},{"$f":"IF(B203=\"\",\"\",+VLOOKUP(B203,'PRESENCIAL NACIONAL - VIRTUALES'!C:N,12,0))","v":0}]
[{"$f":"+IF(Validaciones!A198=\"\",\"\",Validaciones!A198)","v":"SISTEMA DE GESTIÓN SEGURIDAD Y SALUD EN EL TRABAJO SST"},{"$f":"+IF(Validaciones!B198=\"\",\"\",Validaciones!B198)","v":"Curso certificado sistema de gestión.  Fases estándares mínimos. En qué fase está mi empresa con respecto al cumplimiento de las fases dadas por el ministerio?. Modulo 4: Inspección, vigilancia y control.   Fase de verificación Ministerio de trabajo. Requisito módulo 1, 2 y 3"},{"$f":"+IF(Validaciones!C198=\"\",\"\",Validaciones!C198)","v":"Responsable del sistema de gestión, copasst y todas los cargos que rinden cuentas en el sistema de gestión de seguridad y salud en el trabajo)."},{"$f":"+IF(Validaciones!D198=\"\",\"\",Validaciones!D198)","v":"PRESENCIAL "},{"$f":"+IF(Validaciones!E198=\"\",\"\",Validaciones!E198)","v":"BUCARAMANGA"},{"$f":"+IF(Validaciones!F198=\"\",\"\",Validaciones!F198)","v":"2019-05-08"},{"$f":"+IF(Validaciones!G198=\"\",\"\",Validaciones!G198)","v":"8:00 a.m. - 12:00 m"},{"$f":"+IF(Validaciones!H198=\"\",\"\",Validaciones!H198)","v":"Hotel La Triada Cra. 20 #34--22"},{"$f":"+IF(Validaciones!I198=\"\",\"\",Validaciones!I198)","v":2},null,{"$f":"+IF(Validaciones!I200=\"\",\"\",Validaciones!I200)","v":2},{"$f":"IF(B204=\"\",\"\",+VLOOKUP(B204,'PRESENCIAL NACIONAL - VIRTUALES'!C:N,12,0))","v":{"$error":"#VALUE!"}}]
[{"$f":"+IF(Validaciones!A199=\"\",\"\",Validaciones!A199)","v":"SISTEMA DE GESTIÓN SEGURIDAD Y SALUD EN EL TRABAJO SST"},{"$f":"+IF(Validaciones!B199=\"\",\"\",Validaciones!B199)","v":"Curso certificado sistema de gestión.  Fases estándares mínimos. En qué fase está mi empresa con respecto al cumplimiento de las fases dadas por el ministerio?. Modulo 4: Inspección, vigilancia y control.   Fase de verificación Ministerio de trabajo. Requisito módulo 1, 2 y 3"},{"$f":"+IF(Validaciones!C199=\"\",\"\",Validaciones!C199)","v":"Responsable del sistema de gestión, copasst y todas los cargos que rinden cuentas en el sistema de gestión de seguridad y salud en el trabajo)."},{"$f":"+IF(Validaciones!D199=\"\",\"\",Validaciones!D199)","v":"PRESENCIAL "},{"$f":"+IF(Validaciones!E199=\"\",\"\",Validaciones!E199)","v":"CALI"},{"$f":"+IF(Validaciones!F199=\"\",\"\",Validaciones!F199)","v":"2019-05-09"},{"$f":"+IF(Validaciones!G199=\"\",\"\",Validaciones!G199)","v":"8:00 a.m. - 12:00 m"},{"$f":"+IF(Validaciones!H199=\"\",\"\",Validaciones!H199)","v":"Av. 5 Norte # 38N-81"},{"$f":"+IF(Validaciones!I199=\"\",\"\",Validaciones!I199)","v":2},null,{"$f":"+IF(Validaciones!I201=\"\",\"\",Validaciones!I201)","v":2},{"$f":"IF(B205=\"\",\"\",+VLOOKUP(B205,'PRESENCIAL NACIONAL - VIRTUALES'!C:N,12,0))","v":{"$error":"#VALUE!"}}]
[{"$f":"+IF(Validaciones!A200=\"\",\"\",Validaciones!A200)","v":"SISTEMA DE GESTIÓN SEGURIDAD Y SALUD EN EL TRABAJO SST"},{"$f":"+IF(Validaciones!B200=\"\",\"\",Validaciones!B200)","v":"Curso certificado sistema de gestión.  Fases estándares mínimos. En qué fase está mi empresa con respecto al cumplimiento de las fases dadas por el ministerio?. Modulo 4: Inspección, vigilancia y control.   Fase de verificación Ministerio de trabajo. Requisito módulo 1, 2 y 3"},{"$f":"+IF(Validaciones!C200=\"\",\"\",Validaciones!C200)","v":"Responsable del sistema de gestión, copasst y todas los cargos que rinden cuentas en el sistema de gestión de seguridad y salud en el trabajo)."},{"$f":"+IF(Validaciones!D200=\"\",\"\",Validaciones!D200)","v":"PRESENCIAL "},{"$f":"+IF(Validaciones!E200=\"\",\"\",Validaciones!E200)","v":"CARTAGENA"},{"$f":"+IF(Validaciones!F200=\"\",\"\",Validaciones!F200)","v":"2019-05-09"},{"$f":"+IF(Validaciones!G200=\"\",\"\",Validaciones!G200)","v":"8:00 a.m. - 12:00 m"},{"$f":"+IF(Validaciones!H200=\"\",\"\",Validaciones!H200)","v":"Liberty Seguros, Calle del Arsenal No 8B-195 piso 1"},{"$f":"+IF(Validaciones!I200=\"\",\"\",Validaciones!I200)","v":2},null,{"$f":"+IF(Validaciones!I202=\"\",\"\",Validaciones!I202)","v":4},{"$f":"IF(B206=\"\",\"\",+VLOOKUP(B206,'PRESENCIAL NACIONAL - VIRTUALES'!C:N,12,0))","v":{"$error":"#VALUE!"}}]
[{"$f":"+IF(Validaciones!A201=\"\",\"\",Validaciones!A201)","v":"SISTEMA DE GESTIÓN SEGURIDAD Y SALUD EN EL TRABAJO SST"},{"$f":"+IF(Validaciones!B201=\"\",\"\",Validaciones!B201)","v":"Curso certificado sistema de gestión.  Fases estándares mínimos. En qué fase está mi empresa con respecto al cumplimiento de las fases dadas por el ministerio?. Modulo 4: Inspección, vigilancia y control.   Fase de verificación Ministerio de trabajo. Requisito módulo 1, 2 y 3"},{"$f":"+IF(Validaciones!C201=\"\",\"\",Validaciones!C201)","v":"Responsable del sistema de gestión, copasst y todas los cargos que rinden cuentas en el sistema de gestión de seguridad y salud en el trabajo)."},{"$f":"+IF(Validaciones!D201=\"\",\"\",Validaciones!D201)","v":"PRESENCIAL "},{"$f":"+IF(Validaciones!E201=\"\",\"\",Validaciones!E201)","v":"BOGOTÁ"},{"$f":"+IF(Validaciones!F201=\"\",\"\",Validaciones!F201)","v":"2019-05-09"},{"$f":"+IF(Validaciones!G201=\"\",\"\",Validaciones!G201)","v":"8:00 a.m. - 12:00 m"},{"$f":"+IF(Validaciones!H201=\"\",\"\",Validaciones!H201)","v":"Calle 73 N° 10 - 83 Torre C Oficina 302. Salón 302 Fucsia"},{"$f":"+IF(Validaciones!I201=\"\",\"\",Validaciones!I201)","v":2},null,{"$f":"+IF(Validaciones!I203=\"\",\"\",Validaciones!I203)","v":2},{"$f":"IF(B207=\"\",\"\",+VLOOKUP(B207,'PRESENCIAL NACIONAL - VIRTUALES'!C:N,12,0))","v":{"$error":"#VALUE!"}}]
[{"$f":"+IF(Validaciones!A202=\"\",\"\",Validaciones!A202)","v":"SISTEMA DE GESTIÓN SEGURIDAD Y SALUD EN EL TRABAJO SST"},{"$f":"+IF(Validaciones!B202=\"\",\"\",Validaciones!B202)","v":"Curso certificado sistema de gestión.  Fases estándares mínimos. En qué fase está mi empresa con respecto al cumplimiento de las fases dadas por el ministerio?. Modulo 4: Inspección, vigilancia y control.   Fase de verificación Ministerio de trabajo. Requisito módulo 1, 2 y 3"},{"$f":"+IF(Validaciones!C202=\"\",\"\",Validaciones!C202)","v":"Responsable del sistema de gestión, copasst y todas los cargos que rinden cuentas en el sistema de gestión de seguridad y salud en el trabajo)."},{"$f":"+IF(Validaciones!D202=\"\",\"\",Validaciones!D202)","v":"PRESENCIAL "},{"$f":"+IF(Validaciones!E202=\"\",\"\",Validaciones!E202)","v":"MEDELLÍN "},{"$f":"+IF(Validaciones!F202=\"\",\"\",Validaciones!F202)","v":"2019-08-14"},{"$f":"+IF(Validaciones!G202=\"\",\"\",Validaciones!G202)","v":"8:00 a.m. - 12:00 m"},{"$f":"+IF(Validaciones!H202=\"\",\"\",Validaciones!H202)","v":"Carrera 43A No 19-17, auditorio piso 4 torre norte Block Empresarial"},{"$f":"+IF(Validaciones!I202=\"\",\"\",Validaciones!I202)","v":4},null,{"$f":"+IF(Validaciones!I204=\"\",\"\",Validaciones!I204)","v":200},{"$f":"IF(B208=\"\",\"\",+VLOOKUP(B208,'PRESENCIAL NACIONAL - VIRTUALES'!C:N,12,0))","v":{"$error":"#VALUE!"}}]
[{"$f":"+IF(Validaciones!A203=\"\",\"\",Validaciones!A203)","v":"SISTEMA DE GESTIÓN SEGURIDAD Y SALUD EN EL TRABAJO SST"},{"$f":"+IF(Validaciones!B203=\"\",\"\",Validaciones!B203)","v":"SG SST.  Curso de auditoria SG SST"},{"$f":"+IF(Validaciones!C203=\"\",\"\",Validaciones!C203)","v":"Responsable del sistema de gestión, copasst y todas los cargos que rinden cuentas en el sistema de gestión de seguridad y salud en el trabajo)."},{"$f":"+IF(Validaciones!D203=\"\",\"\",Validaciones!D203)","v":"PRESENCIAL "},{"$f":"+IF(Validaciones!E203=\"\",\"\",Validaciones!E203)","v":"BARRANCABERMEJA"},{"$f":"+IF(Validaciones!F203=\"\",\"\",Validaciones!F203)","v":"2019-05-30"},{"$f":"+IF(Validaciones!G203=\"\",\"\",Validaciones!G203)","v":"8:00 a.m. - 12:00 m"},{"$f":"+IF(Validaciones!H203=\"\",\"\",Validaciones!H203)","v":"Hotel San Silvestre Cra 19 # 58a–13"},{"$f":"+IF(Validaciones!I203=\"\",\"\",Validaciones!I203)","v":2},null,{"$f":"+IF(Validaciones!I205=\"\",\"\",Validaciones!I205)","v":2},{"$f":"IF(B209=\"\",\"\",+VLOOKUP(B209,'PRESENCIAL NACIONAL - VIRTUALES'!C:N,12,0))","v":0}]
[{"$f":"+IF(Validaciones!A204=\"\",\"\",Validaciones!A204)","v":"SISTEMA DE GESTIÓN SEGURIDAD Y SALUD EN EL TRABAJO SST"},{"$f":"+IF(Validaciones!B204=\"\",\"\",Validaciones!B204)","v":"SG SST.  Curso de auditoria SG SST"},{"$f":"+IF(Validaciones!C204=\"\",\"\",Validaciones!C204)","v":"Responsable del sistema de gestión, copasst y todas los cargos que rinden cuentas en el sistema de gestión de seguridad y salud en el trabajo)."},{"$f":"+IF(Validaciones!D204=\"\",\"\",Validaciones!D204)","v":"VIRTUAL "},{"$f":"+IF(Validaciones!E204=\"\",\"\",Validaciones!E204)","v":"NACIONAL"},{"$f":"+IF(Validaciones!F204=\"\",\"\",Validaciones!F204)","v":"2019-05-10"},{"$f":"+IF(Validaciones!G204=\"\",\"\",Validaciones!G204)","v":"2:00 p.m. a 5:00 p.m."},{"$f":"+IF(Validaciones!H204=\"\",\"\",Validaciones!H204)","v":"Liberty University"},{"$f":"+IF(Validaciones!I204=\"\",\"\",Validaciones!I204)","v":200},null,{"$f":"+IF(Validaciones!I206=\"\",\"\",Validaciones!I206)","v":2},{"$f":"IF(B210=\"\",\"\",+VLOOKUP(B210,'PRESENCIAL NACIONAL - VIRTUALES'!C:N,12,0))","v":0}]
[{"$f":"+IF(Validaciones!A205=\"\",\"\",Validaciones!A205)","v":"SISTEMA DE GESTIÓN SEGURIDAD Y SALUD EN EL TRABAJO SST"},{"$f":"+IF(Validaciones!B205=\"\",\"\",Validaciones!B205)","v":"Actualización legal en SGSST"},{"$f":"+IF(Validaciones!C205=\"\",\"\",Validaciones!C205)","v":"Responsable del sistema de gestión, copasst y todas los cargos que rinden cuentas en el sistema de gestión de seguridad y salud en el trabajo)."},{"$f":"+IF(Validaciones!D205=\"\",\"\",Validaciones!D205)","v":"PRESENCIAL "},{"$f":"+IF(Validaciones!E205=\"\",\"\",Validaciones!E205)","v":"PEREIRA"},{"$f":"+IF(Validaciones!F205=\"\",\"\",Validaciones!F205)","v":"2019-08-15"},{"$f":"+IF(Validaciones!G205=\"\",\"\",Validaciones!G205)","v":"8:00 a.m. - 12:00 m"},{"$f":"+IF(Validaciones!H205=\"\",\"\",Validaciones!H205)","v":"Previo a la actividad se estará confirmando lugar del evento "},{"$f":"+IF(Validaciones!I205=\"\",\"\",Validaciones!I205)","v":2},null,{"$f":"+IF(Validaciones!I207=\"\",\"\",Validaciones!I207)","v":2},{"$f":"IF(B211=\"\",\"\",+VLOOKUP(B211,'PRESENCIAL NACIONAL - VIRTUALES'!C:N,12,0))","v":0}]
[{"$f":"+IF(Validaciones!A206=\"\",\"\",Validaciones!A206)","v":"SISTEMA DE GESTIÓN SEGURIDAD Y SALUD EN EL TRABAJO SST"},{"$f":"+IF(Validaciones!B206=\"\",\"\",Validaciones!B206)","v":"Actualización legal en SGSST"},{"$f":"+IF(Validaciones!C206=\"\",\"\",Validaciones!C206)","v":"Responsable del sistema de gestión, copasst y todas los cargos que rinden cuentas en el sistema de gestión de seguridad y salud en el trabajo)."},{"$f":"+IF(Validaciones!D206=\"\",\"\",Validaciones!D206)","v":"PRESENCIAL "},{"$f":"+IF(Validaciones!E206=\"\",\"\",Validaciones!E206)","v":"TUNJA"},{"$f":"+IF(Validaciones!F206=\"\",\"\",Validaciones!F206)","v":"2019-08-15"},{"$f":"+IF(Validaciones!G206=\"\",\"\",Validaciones!G206)","v":"8:00 a.m. - 12:00 m"},{"$f":"+IF(Validaciones!H206=\"\",\"\",Validaciones!H206)","v":"Previo a la actividad se estará confirmando lugar del evento "},{"$f":"+IF(Validaciones!I206=\"\",\"\",Validaciones!I206)","v":2},null,{"$f":"+IF(Validaciones!I208=\"\",\"\",Validaciones!I208)","v":2},{"$f":"IF(B212=\"\",\"\",+VLOOKUP(B212,'PRESENCIAL NACIONAL - VIRTUALES'!C:N,12,0))","v":0}]
[{"$f":"+IF(Validaciones!A207=\"\",\"\",Validaciones!A207)","v":"SISTEMA DE GESTIÓN SEGURIDAD Y SALUD EN EL TRABAJO SST"},{"$f":"+IF(Validaciones!B207=\"\",\"\",Validaciones!B207)","v":"Actualización legal en SGSST"},{"$f":"+IF(Validaciones!C207=\"\",\"\",Validaciones!C207)","v":"Responsable del sistema de gestión, copasst y todas los cargos que rinden cuentas en el sistema de gestión de seguridad y salud en el trabajo)."},{"$f":"+IF(Validaciones!D207=\"\",\"\",Validaciones!D207)","v":"PRESENCIAL "},{"$f":"+IF(Validaciones!E207=\"\",\"\",Validaciones!E207)","v":"VILLAVICENCIO"},{"$f":"+IF(Validaciones!F207=\"\",\"\",Validaciones!F207)","v":"2019-08-15"},{"$f":"+IF(Validaciones!G207=\"\",\"\",Validaciones!G207)","v":"8:00 a.m. - 12:00 m"},{"$f":"+IF(Validaciones!H207=\"\",\"\",Validaciones!H207)","v":"Previo a la actividad se estará confirmando lugar del evento "},{"$f":"+IF(Validaciones!I207=\"\",\"\",Validaciones!I207)","v":2},null,{"$f":"+IF(Validaciones!I209=\"\",\"\",Validaciones!I209)","v":200},{"$f":"IF(B213=\"\",\"\",+VLOOKUP(B213,'PRESENCIAL NACIONAL - VIRTUALES'!C:N,12,0))","v":0}]
[{"$f":"+IF(Validaciones!A208=\"\",\"\",Validaciones!A208)","v":"SISTEMA DE GESTIÓN SEGURIDAD Y SALUD EN EL TRABAJO SST"},{"$f":"+IF(Validaciones!B208=\"\",\"\",Validaciones!B208)","v":"Actualización legal en SGSST"},{"$f":"+IF(Validaciones!C208=\"\",\"\",Validaciones!C208)","v":"Responsable del sistema de gestión, copasst y todas los cargos que rinden cuentas en el sistema de gestión de seguridad y salud en el trabajo)."},{"$f":"+IF(Validaciones!D208=\"\",\"\",Validaciones!D208)","v":"PRESENCIAL "},{"$f":"+IF(Validaciones!E208=\"\",\"\",Validaciones!E208)","v":"SOGAMOSO "},{"$f":"+IF(Validaciones!F208=\"\",\"\",Validaciones!F208)","v":"2019-08-15"},{"$f":"+IF(Validaciones!G208=\"\",\"\",Validaciones!G208)","v":"8:00 a.m. - 12:00 m"},{"$f":"+IF(Validaciones!H208=\"\",\"\",Validaciones!H208)","v":"Previo a la actividad se estará confirmando lugar del evento "},{"$f":"+IF(Validaciones!I208=\"\",\"\",Validaciones!I208)","v":2},null,{"$f":"+IF(Validaciones!I210=\"\",\"\",Validaciones!I210)","v":2},{"$f":"IF(B214=\"\",\"\",+VLOOKUP(B214,'PRESENCIAL NACIONAL - VIRTUALES'!C:N,12,0))","v":0}]
[{"$f":"+IF(Validaciones!A209=\"\",\"\",Validaciones!A209)","v":"SISTEMA DE GESTIÓN SEGURIDAD Y SALUD EN EL TRABAJO SST"},{"$f":"+IF(Validaciones!B209=\"\",\"\",Validaciones!B209)","v":"Resolución 0312 de 2019 Estándares Mínimos del Sistema de Gestión de Seguridad y Salud en el Trabajo."},{"$f":"+IF(Validaciones!C209=\"\",\"\",Validaciones!C209)","v":"Responsable del sistema de gestión, copasst y todas los cargos que rinden cuentas en el sistema de gestión de seguridad y salud en el trabajo)."},{"$f":"+IF(Validaciones!D209=\"\",\"\",Validaciones!D209)","v":"VIRTUAL "},{"$f":"+IF(Validaciones!E209=\"\",\"\",Validaciones!E209)","v":"NACIONAL"},{"$f":"+IF(Validaciones!F209=\"\",\"\",Validaciones!F209)","v":"2019-03-27"},{"$f":"+IF(Validaciones!G209=\"\",\"\",Validaciones!G209)","v":"2:00 p.m. 4:00 p.m."},{"$f":"+IF(Validaciones!H209=\"\",\"\",Validaciones!H209)","v":"Liberty University"},{"$f":"+IF(Validaciones!I209=\"\",\"\",Validaciones!I209)","v":200},null,{"$f":"+IF(Validaciones!I211=\"\",\"\",Validaciones!I211)","v":3},{"$f":"IF(B215=\"\",\"\",+VLOOKUP(B215,'PRESENCIAL NACIONAL - VIRTUALES'!C:N,12,0))","v":0}]
[{"$f":"+IF(Validaciones!A210=\"\",\"\",Validaciones!A210)","v":"SISTEMA DE GESTIÓN SEGURIDAD Y SALUD EN EL TRABAJO SST"},{"$f":"+IF(Validaciones!B210=\"\",\"\",Validaciones!B210)","v":"Resolución 0312 de 2019 Estándares Mínimos del Sistema de Gestión de Seguridad y Salud en el Trabajo."},{"$f":"+IF(Validaciones!C210=\"\",\"\",Validaciones!C210)","v":"Responsable del sistema de gestión, copasst y todas los cargos que rinden cuentas en el sistema de gestión de seguridad y salud en el trabajo."},{"$f":"+IF(Validaciones!D210=\"\",\"\",Validaciones!D210)","v":"VIRTUAL "},{"$f":"+IF(Validaciones!E210=\"\",\"\",Validaciones!E210)","v":"NACIONAL"},{"$f":"+IF(Validaciones!F210=\"\",\"\",Validaciones!F210)","v":"2019-03-27"},{"$f":"+IF(Validaciones!G210=\"\",\"\",Validaciones!G210)","v":"2:00 a 5:00 p.m."},{"$f":"+IF(Validaciones!H210=\"\",\"\",Validaciones!H210)","v":"Liberty University"},{"$f":"+IF(Validaciones!I210=\"\",\"\",Validaciones!I210)","v":2},null,{"$f":"+IF(Validaciones!I212=\"\",\"\",Validaciones!I212)","v":2},{"$f":"IF(B216=\"\",\"\",+VLOOKUP(B216,'PRESENCIAL NACIONAL - VIRTUALES'!C:N,12,0))","v":0}]
[{"$f":"+IF(Validaciones!A211=\"\",\"\",Validaciones!A211)","v":"SISTEMA DE GESTIÓN SEGURIDAD Y SALUD EN EL TRABAJO SST"},{"$f":"+IF(Validaciones!B211=\"\",\"\",Validaciones!B211)","v":"Curso certificado sistema de gestión.  Fases estándares mínimos. En qué fase está mi empresa con respecto al cumplimiento de las fases dadas por el ministerio?. Modulo 4: Inspección, vigilancia y control.   Fase de verificación Ministerio de trabajo. "},{"$f":"+IF(Validaciones!C211=\"\",\"\",Validaciones!C211)","v":"Responsable del sistema de gestión, copasst y todas los cargos que rinden cuentas en el sistema de gestión de seguridad y salud en el trabajo)."},{"$f":"+IF(Validaciones!D211=\"\",\"\",Validaciones!D211)","v":"PRESENCIAL "},{"$f":"+IF(Validaciones!E211=\"\",\"\",Validaciones!E211)","v":"BARRANQUILLA"},{"$f":"+IF(Validaciones!F211=\"\",\"\",Validaciones!F211)","v":"2019-05-09"},{"$f":"+IF(Validaciones!G211=\"\",\"\",Validaciones!G211)","v":"8:00 a.m. - 12:00 m"},{"$f":"+IF(Validaciones!H211=\"\",\"\",Validaciones!H211)","v":"ICONTEC Cra 57 No. 70-89 Barranquilla"},{"$f":"+IF(Validaciones!I211=\"\",\"\",Validaciones!I211)","v":3},null,{"$f":"+IF(Validaciones!I213=\"\",\"\",Validaciones!I213)","v":2},{"$f":"IF(B217=\"\",\"\",+VLOOKUP(B217,'PRESENCIAL NACIONAL - VIRTUALES'!C:N,12,0))","v":0}]
[{"$f":"+IF(Validaciones!A212=\"\",\"\",Validaciones!A212)","v":"SISTEMA DE GESTIÓN SEGURIDAD Y SALUD EN EL TRABAJO SST"},{"$f":"+IF(Validaciones!B212=\"\",\"\",Validaciones!B212)","v":"Curso certificado sistema de gestión.  Fases estándares mínimos. En qué fase está mi empresa con respecto al cumplimiento de las fases dadas por el ministerio?. Modulo 4: Inspección, vigilancia y control.  "},{"$f":"+IF(Validaciones!C212=\"\",\"\",Validaciones!C212)","v":"Responsable del sistema de gestión, copasst y todas los cargos que rinden cuentas en el sistema de gestión de seguridad y salud en el trabajo)."},{"$f":"+IF(Validaciones!D212=\"\",\"\",Validaciones!D212)","v":"PRESENCIAL "},{"$f":"+IF(Validaciones!E212=\"\",\"\",Validaciones!E212)","v":"BOGOTÁ"},{"$f":"+IF(Validaciones!F212=\"\",\"\",Validaciones!F212)","v":"2019-10-10"},{"$f":"+IF(Validaciones!G212=\"\",\"\",Validaciones!G212)","v":"8:00 a.m. - 12:00 m"},{"$f":"+IF(Validaciones!H212=\"\",\"\",Validaciones!H212)","v":"Calle 73 N° 10 - 83 Torre C Oficina 302. Salón 302 Fucsia"},{"$f":"+IF(Validaciones!I212=\"\",\"\",Validaciones!I212)","v":2},null,{"$f":"+IF(Validaciones!I214=\"\",\"\",Validaciones!I214)","v":3},{"$f":"IF(B218=\"\",\"\",+VLOOKUP(B218,'PRESENCIAL NACIONAL - VIRTUALES'!C:N,12,0))","v":0}]
[{"$f":"+IF(Validaciones!A213=\"\",\"\",Validaciones!A213)","v":"TAREAS DE ALTO RIESGO "},{"$f":"+IF(Validaciones!B213=\"\",\"\",Validaciones!B213)","v":"Curso tareas de alto riesgo. Módulo 1: Seguridad eléctrica  "},{"$f":"+IF(Validaciones!C213=\"\",\"\",Validaciones!C213)","v":"Personal responsable del sistema de gestión, líderes de proceso, copasst. "},{"$f":"+IF(Validaciones!D213=\"\",\"\",Validaciones!D213)","v":"PRESENCIAL "},{"$f":"+IF(Validaciones!E213=\"\",\"\",Validaciones!E213)","v":"BARRANCABERMEJA"},{"$f":"+IF(Validaciones!F213=\"\",\"\",Validaciones!F213)","v":"2019-07-11"},{"$f":"+IF(Validaciones!G213=\"\",\"\",Validaciones!G213)","v":"8:00 a.m. - 12:00 m"},{"$f":"+IF(Validaciones!H213=\"\",\"\",Validaciones!H213)","v":"Hotel San Silvestre Cra 19 # 58a–13"},{"$f":"+IF(Validaciones!I213=\"\",\"\",Validaciones!I213)","v":2},null,{"$f":"+IF(Validaciones!I215=\"\",\"\",Validaciones!I215)","v":2},{"$f":"IF(B219=\"\",\"\",+VLOOKUP(B219,'PRESENCIAL NACIONAL - VIRTUALES'!C:N,12,0))","v":0}]
[{"$f":"+IF(Validaciones!A214=\"\",\"\",Validaciones!A214)","v":"TAREAS DE ALTO RIESGO "},{"$f":"+IF(Validaciones!B214=\"\",\"\",Validaciones!B214)","v":"Curso tareas de alto riesgo. Módulo 1: Seguridad eléctrica  "},{"$f":"+IF(Validaciones!C214=\"\",\"\",Validaciones!C214)","v":"Personal responsable del sistema de gestión, líderes de proceso, copasst. "},{"$f":"+IF(Validaciones!D214=\"\",\"\",Validaciones!D214)","v":"PRESENCIAL "},{"$f":"+IF(Validaciones!E214=\"\",\"\",Validaciones!E214)","v":"BARRANQUILLA"},{"$f":"+IF(Validaciones!F214=\"\",\"\",Validaciones!F214)","v":"2019-06-20"},{"$f":"+IF(Validaciones!G214=\"\",\"\",Validaciones!G214)","v":"8:00 a.m. - 12:00 m"},{"$f":"+IF(Validaciones!H214=\"\",\"\",Validaciones!H214)","v":"ICONTEC Cra 57 No. 70-89 Barranquilla"},{"$f":"+IF(Validaciones!I214=\"\",\"\",Validaciones!I214)","v":3},null,{"$f":"+IF(Validaciones!I216=\"\",\"\",Validaciones!I216)","v":2},{"$f":"IF(B220=\"\",\"\",+VLOOKUP(B220,'PRESENCIAL NACIONAL - VIRTUALES'!C:N,12,0))","v":0}]
[{"$f":"+IF(Validaciones!A215=\"\",\"\",Validaciones!A215)","v":"TAREAS DE ALTO RIESGO "},{"$f":"+IF(Validaciones!B215=\"\",\"\",Validaciones!B215)","v":"Curso tareas de alto riesgo. Módulo 1: Seguridad eléctrica  "},{"$f":"+IF(Validaciones!C215=\"\",\"\",Validaciones!C215)","v":"Personal responsable del sistema de gestión, líderes de proceso, copasst. "},{"$f":"+IF(Validaciones!D215=\"\",\"\",Validaciones!D215)","v":"PRESENCIAL "},{"$f":"+IF(Validaciones!E215=\"\",\"\",Validaciones!E215)","v":"BUCARAMANGA"},{"$f":"+IF(Validaciones!F215=\"\",\"\",Validaciones!F215)","v":"2019-07-11"},{"$f":"+IF(Validaciones!G215=\"\",\"\",Validaciones!G215)","v":"8:00 a.m. - 12:00 m"},{"$f":"+IF(Validaciones!H215=\"\",\"\",Validaciones!H215)","v":"Hotel La Triada Cra. 20 # 34—22"},{"$f":"+IF(Validaciones!I215=\"\",\"\",Validaciones!I215)","v":2},null,{"$f":"+IF(Validaciones!I217=\"\",\"\",Validaciones!I217)","v":2},{"$f":"IF(B221=\"\",\"\",+VLOOKUP(B221,'PRESENCIAL NACIONAL - VIRTUALES'!C:N,12,0))","v":0}]
[{"$f":"+IF(Validaciones!A216=\"\",\"\",Validaciones!A216)","v":"TAREAS DE ALTO RIESGO "},{"$f":"+IF(Validaciones!B216=\"\",\"\",Validaciones!B216)","v":"Curso tareas de alto riesgo. Módulo 1: Seguridad eléctrica  "},{"$f":"+IF(Validaciones!C216=\"\",\"\",Validaciones!C216)","v":"Personal responsable del sistema de gestión, líderes de proceso, copasst. "},{"$f":"+IF(Validaciones!D216=\"\",\"\",Validaciones!D216)","v":"PRESENCIAL "},{"$f":"+IF(Validaciones!E216=\"\",\"\",Validaciones!E216)","v":"CALI"},{"$f":"+IF(Validaciones!F216=\"\",\"\",Validaciones!F216)","v":"2019-07-11"},{"$f":"+IF(Validaciones!G216=\"\",\"\",Validaciones!G216)","v":"8:00 a.m. - 12:00 m"},{"$f":"+IF(Validaciones!H216=\"\",\"\",Validaciones!H216)","v":"Av. 5 Norte # 38N-81"},{"$f":"+IF(Validaciones!I216=\"\",\"\",Validaciones!I216)","v":2},null,{"$f":"+IF(Validaciones!I218=\"\",\"\",Validaciones!I218)","v":2},{"$f":"IF(B222=\"\",\"\",+VLOOKUP(B222,'PRESENCIAL NACIONAL - VIRTUALES'!C:N,12,0))","v":0}]
[{"$f":"+IF(Validaciones!A217=\"\",\"\",Validaciones!A217)","v":"TAREAS DE ALTO RIESGO "},{"$f":"+IF(Validaciones!B217=\"\",\"\",Validaciones!B217)","v":"Curso tareas de alto riesgo. Módulo 1: Seguridad eléctrica  "},{"$f":"+IF(Validaciones!C217=\"\",\"\",Validaciones!C217)","v":"Personal responsable del sistema de gestión, líderes de proceso, copasst. "},{"$f":"+IF(Validaciones!D217=\"\",\"\",Validaciones!D217)","v":"PRESENCIAL "},{"$f":"+IF(Validaciones!E217=\"\",\"\",Validaciones!E217)","v":"CARTAGENA"},{"$f":"+IF(Validaciones!F217=\"\",\"\",Validaciones!F217)","v":"2019-07-11"},{"$f":"+IF(Validaciones!G217=\"\",\"\",Validaciones!G217)","v":"8:00 a.m. - 12:00 m"},{"$f":"+IF(Validaciones!H217=\"\",\"\",Validaciones!H217)","v":"Liberty Seguros, Calle del Arsenal No 8B-195 piso 1"},{"$f":"+IF(Validaciones!I217=\"\",\"\",Validaciones!I217)","v":2},null,{"$f":"+IF(Validaciones!I219=\"\",\"\",Validaciones!I219)","v":4},{"$f":"IF(B223=\"\",\"\",+VLOOKUP(B223,'PRESENCIAL NACIONAL - VIRTUALES'!C:N,12,0))","v":0}]
[{"$f":"+IF(Validaciones!A218=\"\",\"\",Validaciones!A218)","v":"TAREAS DE ALTO RIESGO "},{"$f":"+IF(Validaciones!B218=\"\",\"\",Validaciones!B218)","v":"Curso tareas de alto riesgo. Módulo 1: Seguridad eléctrica  "},{"$f":"+IF(Validaciones!C218=\"\",\"\",Validaciones!C218)","v":"Personal responsable del sistema de gestión, líderes de proceso, copasst. "},{"$f":"+IF(Validaciones!D218=\"\",\"\",Validaciones!D218)","v":"PRESENCIAL "},{"$f":"+IF(Validaciones!E218=\"\",\"\",Validaciones!E218)","v":"BOGOTÁ"},{"$f":"+IF(Validaciones!F218=\"\",\"\",Validaciones!F218)","v":"2019-07-11"},{"$f":"+IF(Validaciones!G218=\"\",\"\",Validaciones!G218)","v":"8:00 a.m. - 12:00 m"},{"$f":"+IF(Validaciones!H218=\"\",\"\",Validaciones!H218)","v":"Calle 73 N° 10 - 83 Torre C Oficina 302. Salón 302 Fucsia"},{"$f":"+IF(Validaciones!I218=\"\",\"\",Validaciones!I218)","v":2},null,{"$f":"+IF(Validaciones!I220=\"\",\"\",Validaciones!I220)","v":200},{"$f":"IF(B224=\"\",\"\",+VLOOKUP(B224,'PRESENCIAL NACIONAL - VIRTUALES'!C:N,12,0))","v":0}]
[{"$f":"+IF(Validaciones!A219=\"\",\"\",Validaciones!A219)","v":"TAREAS DE ALTO RIESGO "},{"$f":"+IF(Validaciones!B219=\"\",\"\",Validaciones!B219)","v":"Curso tareas de alto riesgo. Módulo 1: Seguridad eléctrica  "},{"$f":"+IF(Validaciones!C219=\"\",\"\",Validaciones!C219)","v":"Personal responsable del sistema de gestión, líderes de proceso, copasst. "},{"$f":"+IF(Validaciones!D219=\"\",\"\",Validaciones!D219)","v":"PRESENCIAL "},{"$f":"+IF(Validaciones!E219=\"\",\"\",Validaciones!E219)","v":"MEDELLÍN "},{"$f":"+IF(Validaciones!F219=\"\",\"\",Validaciones!F219)","v":"2019-03-19"},{"$f":"+IF(Validaciones!G219=\"\",\"\",Validaciones!G219)","v":"8:00 a.m. - 12:00 m"},{"$f":"+IF(Validaciones!H219=\"\",\"\",Validaciones!H219)","v":"Carrera 43A No 19-17, auditorio piso 4 torre norte Block Empresarial"},{"$f":"+IF(Validaciones!I219=\"\",\"\",Validaciones!I219)","v":4},null,{"$f":"+IF(Validaciones!I221=\"\",\"\",Validaciones!I221)","v":2},{"$f":"IF(B225=\"\",\"\",+VLOOKUP(B225,'PRESENCIAL NACIONAL - VIRTUALES'!C:N,12,0))","v":0}]
[{"$f":"+IF(Validaciones!A220=\"\",\"\",Validaciones!A220)","v":"TAREAS DE ALTO RIESGO "},{"$f":"+IF(Validaciones!B220=\"\",\"\",Validaciones!B220)","v":"Creación UVAE Ministerio de trabajo "},{"$f":"+IF(Validaciones!C220=\"\",\"\",Validaciones!C220)","v":"Personal responsable del sistema de gestión, líderes de proceso, copasst. "},{"$f":"+IF(Validaciones!D220=\"\",\"\",Validaciones!D220)","v":"VIRTUAL "},{"$f":"+IF(Validaciones!E220=\"\",\"\",Validaciones!E220)","v":"NACIONAL"},{"$f":"+IF(Validaciones!F220=\"\",\"\",Validaciones!F220)","v":"2019-08-01"},{"$f":"+IF(Validaciones!G220=\"\",\"\",Validaciones!G220)","v":"2:00 p.m. - 5:00 p.m."},{"$f":"+IF(Validaciones!H220=\"\",\"\",Validaciones!H220)","v":"Liberty University"},{"$f":"+IF(Validaciones!I220=\"\",\"\",Validaciones!I220)","v":200},null,{"$f":"+IF(Validaciones!I222=\"\",\"\",Validaciones!I222)","v":3},{"$f":"IF(B226=\"\",\"\",+VLOOKUP(B226,'PRESENCIAL NACIONAL - VIRTUALES'!C:N,12,0))","v":"Montajes y procesos mgonzalez@montajesyprocesos.com"}]
[{"$f":"+IF(Validaciones!A221=\"\",\"\",Validaciones!A221)","v":"TAREAS DE ALTO RIESGO "},{"$f":"+IF(Validaciones!B221=\"\",\"\",Validaciones!B221)","v":"Curso tareas de alto riesgo. Módulo 2: Operación segura de maquinaria "},{"$f":"+IF(Validaciones!C221=\"\",\"\",Validaciones!C221)","v":"Personal responsable del sistema de gestión, líderes de proceso, copasst. "},{"$f":"+IF(Validaciones!D221=\"\",\"\",Validaciones!D221)","v":"PRESENCIAL "},{"$f":"+IF(Validaciones!E221=\"\",\"\",Validaciones!E221)","v":"BARRANCABERMEJA"},{"$f":"+IF(Validaciones!F221=\"\",\"\",Validaciones!F221)","v":"2019-08-15"},{"$f":"+IF(Validaciones!G221=\"\",\"\",Validaciones!G221)","v":"8:00 a.m. - 12:00 m"},{"$f":"+IF(Validaciones!H221=\"\",\"\",Validaciones!H221)","v":"Hotel San Silvestre Cra 19 # 58a–13"},{"$f":"+IF(Validaciones!I221=\"\",\"\",Validaciones!I221)","v":2},null,{"$f":"+IF(Validaciones!I223=\"\",\"\",Validaciones!I223)","v":2},{"$f":"IF(B227=\"\",\"\",+VLOOKUP(B227,'PRESENCIAL NACIONAL - VIRTUALES'!C:N,12,0))","v":"Montajes y procesos mgonzalez@montajesyprocesos.com"}]
[{"$f":"+IF(Validaciones!A222=\"\",\"\",Validaciones!A222)","v":"TAREAS DE ALTO RIESGO "},{"$f":"+IF(Validaciones!B222=\"\",\"\",Validaciones!B222)","v":"Curso tareas de alto riesgo. Módulo 2: Operación segura de maquinaria "},{"$f":"+IF(Validaciones!C222=\"\",\"\",Validaciones!C222)","v":"Personal responsable del sistema de gestión, líderes de proceso, copasst. "},{"$f":"+IF(Validaciones!D222=\"\",\"\",Validaciones!D222)","v":"PRESENCIAL "},{"$f":"+IF(Validaciones!E222=\"\",\"\",Validaciones!E222)","v":"BARRANQUILLA"},{"$f":"+IF(Validaciones!F222=\"\",\"\",Validaciones!F222)","v":"2019-07-04"},{"$f":"+IF(Validaciones!G222=\"\",\"\",Validaciones!G222)","v":"8:00 a.m. - 12:00 m"},{"$f":"+IF(Validaciones!H222=\"\",\"\",Validaciones!H222)","v":"ICONTEC Cra 57 No. 70-89 Barranquilla"},{"$f":"+IF(Validaciones!I222=\"\",\"\",Validaciones!I222)","v":3},null,{"$f":"+IF(Validaciones!I224=\"\",\"\",Validaciones!I224)","v":2},{"$f":"IF(B228=\"\",\"\",+VLOOKUP(B228,'PRESENCIAL NACIONAL - VIRTUALES'!C:N,12,0))","v":"Montajes y procesos mgonzalez@montajesyprocesos.com"}]
[{"$f":"+IF(Validaciones!A223=\"\",\"\",Validaciones!A223)","v":"TAREAS DE ALTO RIESGO "},{"$f":"+IF(Validaciones!B223=\"\",\"\",Validaciones!B223)","v":"Curso tareas de alto riesgo. Módulo 2: Operación segura de maquinaria "},{"$f":"+IF(Validaciones!C223=\"\",\"\",Validaciones!C223)","v":"Personal responsable del sistema de gestión, líderes de proceso, copasst. "},{"$f":"+IF(Validaciones!D223=\"\",\"\",Validaciones!D223)","v":"PRESENCIAL "},{"$f":"+IF(Validaciones!E223=\"\",\"\",Validaciones!E223)","v":"BUCARAMANGA"},{"$f":"+IF(Validaciones!F223=\"\",\"\",Validaciones!F223)","v":"2019-08-15"},{"$f":"+IF(Validaciones!G223=\"\",\"\",Validaciones!G223)","v":"8:00 a.m. - 12:00 m"},{"$f":"+IF(Validaciones!H223=\"\",\"\",Validaciones!H223)","v":"Hotel La Triada Cra. 20 # 34—22"},{"$f":"+IF(Validaciones!I223=\"\",\"\",Validaciones!I223)","v":2},null,{"$f":"+IF(Validaciones!I225=\"\",\"\",Validaciones!I225)","v":2},{"$f":"IF(B229=\"\",\"\",+VLOOKUP(B229,'PRESENCIAL NACIONAL - VIRTUALES'!C:N,12,0))","v":"Montajes y procesos mgonzalez@montajesyprocesos.com"}]
[{"$f":"+IF(Validaciones!A224=\"\",\"\",Validaciones!A224)","v":"TAREAS DE ALTO RIESGO "},{"$f":"+IF(Validaciones!B224=\"\",\"\",Validaciones!B224)","v":"Curso tareas de alto riesgo. Módulo 2: Operación segura de maquinaria "},{"$f":"+IF(Validaciones!C224=\"\",\"\",Validaciones!C224)","v":"Personal responsable del sistema de gestión, líderes de proceso, copasst. "},{"$f":"+IF(Validaciones!D224=\"\",\"\",Validaciones!D224)","v":"PRESENCIAL "},{"$f":"+IF(Validaciones!E224=\"\",\"\",Validaciones!E224)","v":"CALI"},{"$f":"+IF(Validaciones!F224=\"\",\"\",Validaciones!F224)","v":"2019-08-16"},{"$f":"+IF(Validaciones!G224=\"\",\"\",Validaciones!G224)","v":"8:00 a.m. - 12:00 m"},{"$f":"+IF(Validaciones!H224=\"\",\"\",Validaciones!H224)","v":"Av. 5 Norte # 38N-81"},{"$f":"+IF(Validaciones!I224=\"\",\"\",Validaciones!I224)","v":2},null,{"$f":"+IF(Validaciones!I226=\"\",\"\",Validaciones!I226)","v":2},{"$f":"IF(B230=\"\",\"\",+VLOOKUP(B230,'PRESENCIAL NACIONAL - VIRTUALES'!C:N,12,0))","v":"Montajes y procesos mgonzalez@montajesyprocesos.com"}]
[{"$f":"+IF(Validaciones!A225=\"\",\"\",Validaciones!A225)","v":"TAREAS DE ALTO RIESGO "},{"$f":"+IF(Validaciones!B225=\"\",\"\",Validaciones!B225)","v":"Curso tareas de alto riesgo. Módulo 2: Operación segura de maquinaria "},{"$f":"+IF(Validaciones!C225=\"\",\"\",Validaciones!C225)","v":"Personal responsable del sistema de gestión, líderes de proceso, copasst. "},{"$f":"+IF(Validaciones!D225=\"\",\"\",Validaciones!D225)","v":"PRESENCIAL "},{"$f":"+IF(Validaciones!E225=\"\",\"\",Validaciones!E225)","v":"CARTAGENA"},{"$f":"+IF(Validaciones!F225=\"\",\"\",Validaciones!F225)","v":"2019-08-15"},{"$f":"+IF(Validaciones!G225=\"\",\"\",Validaciones!G225)","v":"8:00 a.m. - 12:00 m"},{"$f":"+IF(Validaciones!H225=\"\",\"\",Validaciones!H225)","v":"Liberty Seguros, Calle del Arsenal No 8B-195 piso 1"},{"$f":"+IF(Validaciones!I225=\"\",\"\",Validaciones!I225)","v":2},null,{"$f":"+IF(Validaciones!I227=\"\",\"\",Validaciones!I227)","v":4},{"$f":"IF(B231=\"\",\"\",+VLOOKUP(B231,'PRESENCIAL NACIONAL - VIRTUALES'!C:N,12,0))","v":"Montajes y procesos mgonzalez@montajesyprocesos.com"}]
[{"$f":"+IF(Validaciones!A226=\"\",\"\",Validaciones!A226)","v":"TAREAS DE ALTO RIESGO "},{"$f":"+IF(Validaciones!B226=\"\",\"\",Validaciones!B226)","v":"Curso tareas de alto riesgo. Módulo 2: Operación segura de maquinaria "},{"$f":"+IF(Validaciones!C226=\"\",\"\",Validaciones!C226)","v":"Personal responsable del sistema de gestión, líderes de proceso, copasst. "},{"$f":"+IF(Validaciones!D226=\"\",\"\",Validaciones!D226)","v":"PRESENCIAL "},{"$f":"+IF(Validaciones!E226=\"\",\"\",Validaciones!E226)","v":"BOGOTÁ"},{"$f":"+IF(Validaciones!F226=\"\",\"\",Validaciones!F226)","v":"2019-08-15"},{"$f":"+IF(Validaciones!G226=\"\",\"\",Validaciones!G226)","v":"8:00 a.m. - 12:00 m"},{"$f":"+IF(Validaciones!H226=\"\",\"\",Validaciones!H226)","v":"Calle 73 N° 10 - 83 Torre C Oficina 302. Salón 302 Fucsia"},{"$f":"+IF(Validaciones!I226=\"\",\"\",Validaciones!I226)","v":2},null,{"$f":"+IF(Validaciones!I228=\"\",\"\",Validaciones!I228)","v":2},{"$f":"IF(B232=\"\",\"\",+VLOOKUP(B232,'PRESENCIAL NACIONAL - VIRTUALES'!C:N,12,0))","v":"Montajes y procesos mgonzalez@montajesyprocesos.com"}]
[{"$f":"+IF(Validaciones!A227=\"\",\"\",Validaciones!A227)","v":"TAREAS DE ALTO RIESGO "},{"$f":"+IF(Validaciones!B227=\"\",\"\",Validaciones!B227)","v":"Curso tareas de alto riesgo. Módulo 2: Operación segura de maquinaria "},{"$f":"+IF(Validaciones!C227=\"\",\"\",Validaciones!C227)","v":"Personal responsable del sistema de gestión, líderes de proceso, copasst. "},{"$f":"+IF(Validaciones!D227=\"\",\"\",Validaciones!D227)","v":"PRESENCIAL "},{"$f":"+IF(Validaciones!E227=\"\",\"\",Validaciones!E227)","v":"MEDELLÍN "},{"$f":"+IF(Validaciones!F227=\"\",\"\",Validaciones!F227)","v":"2019-07-16"},{"$f":"+IF(Validaciones!G227=\"\",\"\",Validaciones!G227)","v":"8:00 a.m. - 12:00 m"},{"$f":"+IF(Validaciones!H227=\"\",\"\",Validaciones!H227)","v":"Carrera 43A No 19-17, auditorio piso 4 torre norte Block Empresarial"},{"$f":"+IF(Validaciones!I227=\"\",\"\",Validaciones!I227)","v":4},null,{"$f":"+IF(Validaciones!I229=\"\",\"\",Validaciones!I229)","v":3},{"$f":"IF(B233=\"\",\"\",+VLOOKUP(B233,'PRESENCIAL NACIONAL - VIRTUALES'!C:N,12,0))","v":"Montajes y procesos mgonzalez@montajesyprocesos.com"}]
[{"$f":"+IF(Validaciones!A228=\"\",\"\",Validaciones!A228)","v":"TAREAS DE ALTO RIESGO "},{"$f":"+IF(Validaciones!B228=\"\",\"\",Validaciones!B228)","v":"Curso tareas de alto riesgo. Módulo 3: Espacio confinado y atmósferas peligrosas.   Seguridad en excavaciones.  "},{"$f":"+IF(Validaciones!C228=\"\",\"\",Validaciones!C228)","v":"Personal responsable del sistema de gestión, líderes de proceso, copasst. "},{"$f":"+IF(Validaciones!D228=\"\",\"\",Validaciones!D228)","v":"PRESENCIAL "},{"$f":"+IF(Validaciones!E228=\"\",\"\",Validaciones!E228)","v":"BARRANCABERMEJA"},{"$f":"+IF(Validaciones!F228=\"\",\"\",Validaciones!F228)","v":"2019-09-12"},{"$f":"+IF(Validaciones!G228=\"\",\"\",Validaciones!G228)","v":"8:00 a.m. - 12:00 m"},{"$f":"+IF(Validaciones!H228=\"\",\"\",Validaciones!H228)","v":"Hotel San Silvestre Cra 19 # 58a–13"},{"$f":"+IF(Validaciones!I228=\"\",\"\",Validaciones!I228)","v":2},null,{"$f":"+IF(Validaciones!I230=\"\",\"\",Validaciones!I230)","v":2},{"$f":"IF(B234=\"\",\"\",+VLOOKUP(B234,'PRESENCIAL NACIONAL - VIRTUALES'!C:N,12,0))","v":0}]
[{"$f":"+IF(Validaciones!A229=\"\",\"\",Validaciones!A229)","v":"TAREAS DE ALTO RIESGO "},{"$f":"+IF(Validaciones!B229=\"\",\"\",Validaciones!B229)","v":"Curso tareas de alto riesgo. Módulo 3: Espacio confinado y atmósferas peligrosas.   Seguridad en excavaciones.  "},{"$f":"+IF(Validaciones!C229=\"\",\"\",Validaciones!C229)","v":"Personal responsable del sistema de gestión, líderes de proceso, copasst. "},{"$f":"+IF(Validaciones!D229=\"\",\"\",Validaciones!D229)","v":"PRESENCIAL "},{"$f":"+IF(Validaciones!E229=\"\",\"\",Validaciones!E229)","v":"BARRANQUILLA"},{"$f":"+IF(Validaciones!F229=\"\",\"\",Validaciones!F229)","v":"2019-07-18"},{"$f":"+IF(Validaciones!G229=\"\",\"\",Validaciones!G229)","v":"8:00 a.m. - 12:00 m"},{"$f":"+IF(Validaciones!H229=\"\",\"\",Validaciones!H229)","v":"ICONTEC Cra 57 No. 70-89 Barranquilla"},{"$f":"+IF(Validaciones!I229=\"\",\"\",Validaciones!I229)","v":3},null,{"$f":"+IF(Validaciones!I231=\"\",\"\",Validaciones!I231)","v":2},{"$f":"IF(B235=\"\",\"\",+VLOOKUP(B235,'PRESENCIAL NACIONAL - VIRTUALES'!C:N,12,0))","v":0}]
[{"$f":"+IF(Validaciones!A230=\"\",\"\",Validaciones!A230)","v":"TAREAS DE ALTO RIESGO "},{"$f":"+IF(Validaciones!B230=\"\",\"\",Validaciones!B230)","v":"Curso tareas de alto riesgo. Módulo 3: Espacio confinado y atmósferas peligrosas.   Seguridad en excavaciones.  "},{"$f":"+IF(Validaciones!C230=\"\",\"\",Validaciones!C230)","v":"Personal responsable del sistema de gestión, líderes de proceso, copasst. "},{"$f":"+IF(Validaciones!D230=\"\",\"\",Validaciones!D230)","v":"PRESENCIAL "},{"$f":"+IF(Validaciones!E230=\"\",\"\",Validaciones!E230)","v":"BUCARAMANGA"},{"$f":"+IF(Validaciones!F230=\"\",\"\",Validaciones!F230)","v":"2019-09-12"},{"$f":"+IF(Validaciones!G230=\"\",\"\",Validaciones!G230)","v":"8:00 a.m. - 12:00 m"},{"$f":"+IF(Validaciones!H230=\"\",\"\",Validaciones!H230)","v":"Hotel La Triada Cra. 20 # 34—22"},{"$f":"+IF(Validaciones!I230=\"\",\"\",Validaciones!I230)","v":2},null,{"$f":"+IF(Validaciones!I232=\"\",\"\",Validaciones!I232)","v":2},{"$f":"IF(B236=\"\",\"\",+VLOOKUP(B236,'PRESENCIAL NACIONAL - VIRTUALES'!C:N,12,0))","v":0}]
[{"$f":"+IF(Validaciones!A231=\"\",\"\",Validaciones!A231)","v":"TAREAS DE ALTO RIESGO "},{"$f":"+IF(Validaciones!B231=\"\",\"\",Validaciones!B231)","v":"Curso tareas de alto riesgo. Módulo 3: Espacio confinado y atmósferas peligrosas.   Seguridad en excavaciones.  "},{"$f":"+IF(Validaciones!C231=\"\",\"\",Validaciones!C231)","v":"Personal responsable del sistema de gestión, líderes de proceso, copasst. "},{"$f":"+IF(Validaciones!D231=\"\",\"\",Validaciones!D231)","v":"PRESENCIAL "},{"$f":"+IF(Validaciones!E231=\"\",\"\",Validaciones!E231)","v":"CALI"},{"$f":"+IF(Validaciones!F231=\"\",\"\",Validaciones!F231)","v":"2019-09-13"},{"$f":"+IF(Validaciones!G231=\"\",\"\",Validaciones!G231)","v":"8:00 a.m. - 12:00 m"},{"$f":"+IF(Validaciones!H231=\"\",\"\",Validaciones!H231)","v":"Av. 5 Norte # 38N-81"},{"$f":"+IF(Validaciones!I231=\"\",\"\",Validaciones!I231)","v":2},null,{"$f":"+IF(Validaciones!I233=\"\",\"\",Validaciones!I233)","v":2},{"$f":"IF(B237=\"\",\"\",+VLOOKUP(B237,'PRESENCIAL NACIONAL - VIRTUALES'!C:N,12,0))","v":0}]
[{"$f":"+IF(Validaciones!A232=\"\",\"\",Validaciones!A232)","v":"TAREAS DE ALTO RIESGO "},{"$f":"+IF(Validaciones!B232=\"\",\"\",Validaciones!B232)","v":"Curso tareas de alto riesgo. Módulo 3: Espacio confinado y atmósferas peligrosas.   Seguridad en excavaciones.  "},{"$f":"+IF(Validaciones!C232=\"\",\"\",Validaciones!C232)","v":"Personal responsable del sistema de gestión, líderes de proceso, copasst. "},{"$f":"+IF(Validaciones!D232=\"\",\"\",Validaciones!D232)","v":"PRESENCIAL "},{"$f":"+IF(Validaciones!E232=\"\",\"\",Validaciones!E232)","v":"CARTAGENA"},{"$f":"+IF(Validaciones!F232=\"\",\"\",Validaciones!F232)","v":"2019-09-16"},{"$f":"+IF(Validaciones!G232=\"\",\"\",Validaciones!G232)","v":"8:00 a.m. - 12:00 m"},{"$f":"+IF(Validaciones!H232=\"\",\"\",Validaciones!H232)","v":"Liberty Seguros, Calle del Arsenal No 8B-195 piso 1"},{"$f":"+IF(Validaciones!I232=\"\",\"\",Validaciones!I232)","v":2},null,{"$f":"+IF(Validaciones!I234=\"\",\"\",Validaciones!I234)","v":4},{"$f":"IF(B238=\"\",\"\",+VLOOKUP(B238,'PRESENCIAL NACIONAL - VIRTUALES'!C:N,12,0))","v":0}]
[{"$f":"+IF(Validaciones!A233=\"\",\"\",Validaciones!A233)","v":"TAREAS DE ALTO RIESGO "},{"$f":"+IF(Validaciones!B233=\"\",\"\",Validaciones!B233)","v":"Curso tareas de alto riesgo. Módulo 3: Espacio confinado y atmósferas peligrosas.   Seguridad en excavaciones.  "},{"$f":"+IF(Validaciones!C233=\"\",\"\",Validaciones!C233)","v":"Personal responsable del sistema de gestión, líderes de proceso, copasst. "},{"$f":"+IF(Validaciones!D233=\"\",\"\",Validaciones!D233)","v":"PRESENCIAL "},{"$f":"+IF(Validaciones!E233=\"\",\"\",Validaciones!E233)","v":"BOGOTÁ"},{"$f":"+IF(Validaciones!F233=\"\",\"\",Validaciones!F233)","v":"2019-09-26"},{"$f":"+IF(Validaciones!G233=\"\",\"\",Validaciones!G233)","v":"8:00 a.m. - 12:00 m"},{"$f":"+IF(Validaciones!H233=\"\",\"\",Validaciones!H233)","v":"Calle 73 N° 10 - 83 Torre C Oficina 302. Salón 302 Fucsia"},{"$f":"+IF(Validaciones!I233=\"\",\"\",Validaciones!I233)","v":2},null,{"$f":"+IF(Validaciones!I235=\"\",\"\",Validaciones!I235)","v":2},{"$f":"IF(B239=\"\",\"\",+VLOOKUP(B239,'PRESENCIAL NACIONAL - VIRTUALES'!C:N,12,0))","v":0}]
[{"$f":"+IF(Validaciones!A234=\"\",\"\",Validaciones!A234)","v":"TAREAS DE ALTO RIESGO "},{"$f":"+IF(Validaciones!B234=\"\",\"\",Validaciones!B234)","v":"Curso tareas de alto riesgo. Módulo 3: Espacio confinado y atmósferas peligrosas.   Seguridad en excavaciones.  "},{"$f":"+IF(Validaciones!C234=\"\",\"\",Validaciones!C234)","v":"Personal responsable del sistema de gestión, líderes de proceso, copasst. "},{"$f":"+IF(Validaciones!D234=\"\",\"\",Validaciones!D234)","v":"PRESENCIAL "},{"$f":"+IF(Validaciones!E234=\"\",\"\",Validaciones!E234)","v":"MEDELLÍN "},{"$f":"+IF(Validaciones!F234=\"\",\"\",Validaciones!F234)","v":"2019-09-04"},{"$f":"+IF(Validaciones!G234=\"\",\"\",Validaciones!G234)","v":"8:00 a.m. - 12:00 m"},{"$f":"+IF(Validaciones!H234=\"\",\"\",Validaciones!H234)","v":"Carrera 43A No 19-17, auditorio piso 4 torre norte Block Empresarial"},{"$f":"+IF(Validaciones!I234=\"\",\"\",Validaciones!I234)","v":4},null,{"$f":"+IF(Validaciones!I236=\"\",\"\",Validaciones!I236)","v":3},{"$f":"IF(B240=\"\",\"\",+VLOOKUP(B240,'PRESENCIAL NACIONAL - VIRTUALES'!C:N,12,0))","v":0}]
[{"$f":"+IF(Validaciones!A235=\"\",\"\",Validaciones!A235)","v":"TAREAS DE ALTO RIESGO "},{"$f":"+IF(Validaciones!B235=\"\",\"\",Validaciones!B235)","v":"Curso tareas de alto riesgo. Módulo 4: Elaboración de procedimientos seguros, Análisis de tareas seguras y permisos de trabajo. "},{"$f":"+IF(Validaciones!C235=\"\",\"\",Validaciones!C235)","v":"Personal responsable del sistema de gestión, líderes de proceso, copasst. "},{"$f":"+IF(Validaciones!D235=\"\",\"\",Validaciones!D235)","v":"PRESENCIAL "},{"$f":"+IF(Validaciones!E235=\"\",\"\",Validaciones!E235)","v":"BARRANCABERMEJA"},{"$f":"+IF(Validaciones!F235=\"\",\"\",Validaciones!F235)","v":"2019-11-07"},{"$f":"+IF(Validaciones!G235=\"\",\"\",Validaciones!G235)","v":"8:00 a.m. - 12:00 m"},{"$f":"+IF(Validaciones!H235=\"\",\"\",Validaciones!H235)","v":"Hotel San Silvestre Cra 19 # 58a–13"},{"$f":"+IF(Validaciones!I235=\"\",\"\",Validaciones!I235)","v":2},null,{"$f":"+IF(Validaciones!I237=\"\",\"\",Validaciones!I237)","v":2},{"$f":"IF(B241=\"\",\"\",+VLOOKUP(B241,'PRESENCIAL NACIONAL - VIRTUALES'!C:N,12,0))","v":"Montajes y procesos mgonzalez@montajesyprocesos.com"}]
[{"$f":"+IF(Validaciones!A236=\"\",\"\",Validaciones!A236)","v":"TAREAS DE ALTO RIESGO "},{"$f":"+IF(Validaciones!B236=\"\",\"\",Validaciones!B236)","v":"Curso tareas de alto riesgo. Módulo 4: Elaboración de procedimientos seguros, Análisis de tareas seguras y permisos de trabajo. "},{"$f":"+IF(Validaciones!C236=\"\",\"\",Validaciones!C236)","v":"Personal responsable del sistema de gestión, líderes de proceso, copasst. "},{"$f":"+IF(Validaciones!D236=\"\",\"\",Validaciones!D236)","v":"PRESENCIAL "},{"$f":"+IF(Validaciones!E236=\"\",\"\",Validaciones!E236)","v":"BARRANQUILLA"},{"$f":"+IF(Validaciones!F236=\"\",\"\",Validaciones!F236)","v":"2019-08-01"},{"$f":"+IF(Validaciones!G236=\"\",\"\",Validaciones!G236)","v":"8:00 a.m. - 12:00 m"},{"$f":"+IF(Validaciones!H236=\"\",\"\",Validaciones!H236)","v":"ICONTEC Cra 57 No. 70-89 Barranquilla"},{"$f":"+IF(Validaciones!I236=\"\",\"\",Validaciones!I236)","v":3},null,{"$f":"+IF(Validaciones!I238=\"\",\"\",Validaciones!I238)","v":2},{"$f":"IF(B242=\"\",\"\",+VLOOKUP(B242,'PRESENCIAL NACIONAL - VIRTUALES'!C:N,12,0))","v":"Montajes y procesos mgonzalez@montajesyprocesos.com"}]
[{"$f":"+IF(Validaciones!A237=\"\",\"\",Validaciones!A237)","v":"TAREAS DE ALTO RIESGO "},{"$f":"+IF(Validaciones!B237=\"\",\"\",Validaciones!B237)","v":"Curso tareas de alto riesgo. Módulo 4: Elaboración de procedimientos seguros, Análisis de tareas seguras y permisos de trabajo. "},{"$f":"+IF(Validaciones!C237=\"\",\"\",Validaciones!C237)","v":"Personal responsable del sistema de gestión, líderes de proceso, copasst. "},{"$f":"+IF(Validaciones!D237=\"\",\"\",Validaciones!D237)","v":"PRESENCIAL "},{"$f":"+IF(Validaciones!E237=\"\",\"\",Validaciones!E237)","v":"BUCARAMANGA"},{"$f":"+IF(Validaciones!F237=\"\",\"\",Validaciones!F237)","v":"2019-11-07"},{"$f":"+IF(Validaciones!G237=\"\",\"\",Validaciones!G237)","v":"8:00 a.m. - 12:00 m"},{"$f":"+IF(Validaciones!H237=\"\",\"\",Validaciones!H237)","v":"Hotel La Triada Cra. 20 #34--22"},{"$f":"+IF(Validaciones!I237=\"\",\"\",Validaciones!I237)","v":2},null,{"$f":"+IF(Validaciones!I239=\"\",\"\",Validaciones!I239)","v":2},{"$f":"IF(B243=\"\",\"\",+VLOOKUP(B243,'PRESENCIAL NACIONAL - VIRTUALES'!C:N,12,0))","v":"Montajes y procesos mgonzalez@montajesyprocesos.com"}]
[{"$f":"+IF(Validaciones!A238=\"\",\"\",Validaciones!A238)","v":"TAREAS DE ALTO RIESGO "},{"$f":"+IF(Validaciones!B238=\"\",\"\",Validaciones!B238)","v":"Curso tareas de alto riesgo. Módulo 4: Elaboración de procedimientos seguros, Análisis de tareas seguras y permisos de trabajo. "},{"$f":"+IF(Validaciones!C238=\"\",\"\",Validaciones!C238)","v":"Personal responsable del sistema de gestión, líderes de proceso, copasst. "},{"$f":"+IF(Validaciones!D238=\"\",\"\",Validaciones!D238)","v":"PRESENCIAL "},{"$f":"+IF(Validaciones!E238=\"\",\"\",Validaciones!E238)","v":"CALI"},{"$f":"+IF(Validaciones!F238=\"\",\"\",Validaciones!F238)","v":"2019-11-21"},{"$f":"+IF(Validaciones!G238=\"\",\"\",Validaciones!G238)","v":"8:00 a.m. - 12:00 m"},{"$f":"+IF(Validaciones!H238=\"\",\"\",Validaciones!H238)","v":"Av. 5 Norte # 38N-81"},{"$f":"+IF(Validaciones!I238=\"\",\"\",Validaciones!I238)","v":2},null,{"$f":"+IF(Validaciones!I240=\"\",\"\",Validaciones!I240)","v":2},{"$f":"IF(B244=\"\",\"\",+VLOOKUP(B244,'PRESENCIAL NACIONAL - VIRTUALES'!C:N,12,0))","v":"Montajes y procesos mgonzalez@montajesyprocesos.com"}]
[{"$f":"+IF(Validaciones!A239=\"\",\"\",Validaciones!A239)","v":"TAREAS DE ALTO RIESGO "},{"$f":"+IF(Validaciones!B239=\"\",\"\",Validaciones!B239)","v":"Curso tareas de alto riesgo. Módulo 4: Elaboración de procedimientos seguros, Análisis de tareas seguras y permisos de trabajo. "},{"$f":"+IF(Validaciones!C239=\"\",\"\",Validaciones!C239)","v":"Personal responsable del sistema de gestión, líderes de proceso, copasst. "},{"$f":"+IF(Validaciones!D239=\"\",\"\",Validaciones!D239)","v":"PRESENCIAL "},{"$f":"+IF(Validaciones!E239=\"\",\"\",Validaciones!E239)","v":"CARTAGENA"},{"$f":"+IF(Validaciones!F239=\"\",\"\",Validaciones!F239)","v":"2019-11-06"},{"$f":"+IF(Validaciones!G239=\"\",\"\",Validaciones!G239)","v":"8:00 a.m. - 12:00 m"},{"$f":"+IF(Validaciones!H239=\"\",\"\",Validaciones!H239)","v":"Liberty Seguros, Calle del Arsenal No 8B-195 piso 1"},{"$f":"+IF(Validaciones!I239=\"\",\"\",Validaciones!I239)","v":2},null,{"$f":"+IF(Validaciones!I241=\"\",\"\",Validaciones!I241)","v":4},{"$f":"IF(B245=\"\",\"\",+VLOOKUP(B245,'PRESENCIAL NACIONAL - VIRTUALES'!C:N,12,0))","v":"Montajes y procesos mgonzalez@montajesyprocesos.com"}]
[{"$f":"+IF(Validaciones!A240=\"\",\"\",Validaciones!A240)","v":"TAREAS DE ALTO RIESGO "},{"$f":"+IF(Validaciones!B240=\"\",\"\",Validaciones!B240)","v":"Curso tareas de alto riesgo. Módulo 4: Elaboración de procedimientos seguros, Análisis de tareas seguras y permisos de trabajo. "},{"$f":"+IF(Validaciones!C240=\"\",\"\",Validaciones!C240)","v":"Personal responsable del sistema de gestión, líderes de proceso, copasst. "},{"$f":"+IF(Validaciones!D240=\"\",\"\",Validaciones!D240)","v":"PRESENCIAL "},{"$f":"+IF(Validaciones!E240=\"\",\"\",Validaciones!E240)","v":"BOGOTÁ"},{"$f":"+IF(Validaciones!F240=\"\",\"\",Validaciones!F240)","v":"2019-11-08"},{"$f":"+IF(Validaciones!G240=\"\",\"\",Validaciones!G240)","v":"8:00 a.m. - 12:00 m"},{"$f":"+IF(Validaciones!H240=\"\",\"\",Validaciones!H240)","v":"Calle 73 N° 10 - 83 Torre C Oficina 302. Salón 302 Fucsia"},{"$f":"+IF(Validaciones!I240=\"\",\"\",Validaciones!I240)","v":2},null,{"$f":"+IF(Validaciones!I242=\"\",\"\",Validaciones!I242)","v":"(en blanco)"},{"$f":"IF(B246=\"\",\"\",+VLOOKUP(B246,'PRESENCIAL NACIONAL - VIRTUALES'!C:N,12,0))","v":"Montajes y procesos mgonzalez@montajesyprocesos.com"}]
[{"$f":"+IF(Validaciones!A241=\"\",\"\",Validaciones!A241)","v":"TAREAS DE ALTO RIESGO "},{"$f":"+IF(Validaciones!B241=\"\",\"\",Validaciones!B241)","v":"Curso tareas de alto riesgo. Módulo 4: Elaboración de procedimientos seguros, Análisis de tareas seguras y permisos de trabajo. "},{"$f":"+IF(Validaciones!C241=\"\",\"\",Validaciones!C241)","v":"Personal responsable del sistema de gestión, líderes de proceso, copasst. "},{"$f":"+IF(Validaciones!D241=\"\",\"\",Validaciones!D241)","v":"PRESENCIAL "},{"$f":"+IF(Validaciones!E241=\"\",\"\",Validaciones!E241)","v":"MEDELLÍN "},{"$f":"+IF(Validaciones!F241=\"\",\"\",Validaciones!F241)","v":"2019-10-24"},{"$f":"+IF(Validaciones!G241=\"\",\"\",Validaciones!G241)","v":"8:00 a.m. - 12:00 m"},{"$f":"+IF(Validaciones!H241=\"\",\"\",Validaciones!H241)","v":"Carrera 43A No 19-17, auditorio piso 4 torre norte Block Empresarial"},{"$f":"+IF(Validaciones!I241=\"\",\"\",Validaciones!I241)","v":4},null,{"$f":"+IF(Validaciones!I243=\"\",\"\",Validaciones!I243)","v":"(en blanco)"},{"$f":"IF(B247=\"\",\"\",+VLOOKUP(B247,'PRESENCIAL NACIONAL - VIRTUALES'!C:N,12,0))","v":"Montajes y procesos mgonzalez@montajesyprocesos.com"}]
[{"$f":"+IF(Validaciones!A242=\"\",\"\",Validaciones!A242)","v":"TRABAJO EN ALTURA "},{"$f":"+IF(Validaciones!B242=\"\",\"\",Validaciones!B242)","v":"Entrenamiento para trabajos en alturas -  (Reentrenamiento)"},{"$f":"+IF(Validaciones!C242=\"\",\"\",Validaciones!C242)","v":"Personal con exposición a peligro por condición de seguridad, trabajo en alturas"},{"$f":"+IF(Validaciones!D242=\"\",\"\",Validaciones!D242)","v":"PRESENCIAL "},{"$f":"+IF(Validaciones!E242=\"\",\"\",Validaciones!E242)","v":"BOGOTÁ"},{"$f":"+IF(Validaciones!F242=\"\",\"\",Validaciones!F242)","v":"2019-02-01"},{"$f":"+IF(Validaciones!G242=\"\",\"\",Validaciones!G242)","v":"8:00 am - 5:00 pm\n20 HORAS\n"},{"$f":"+IF(Validaciones!H242=\"\",\"\",Validaciones!H242)","v":"Sede Complejo Cazuca – Autopista sur Carrera 4ª N° 53 – 54"},{"$f":"+IF(Validaciones!I242=\"\",\"\",Validaciones!I242)","v":"(en blanco)"},null,{"$f":"+IF(Validaciones!I244=\"\",\"\",Validaciones!I244)","v":"(en blanco)"},{"$f":"IF(B248=\"\",\"\",+VLOOKUP(B248,'PRESENCIAL NACIONAL - VIRTUALES'!C:N,12,0))","v":"SENA"}]
[{"$f":"+IF(Validaciones!A243=\"\",\"\",Validaciones!A243)","v":"TRABAJO EN ALTURA "},{"$f":"+IF(Validaciones!B243=\"\",\"\",Validaciones!B243)","v":"Entrenamiento para trabajos en alturas -  (Reentrenamiento)"},{"$f":"+IF(Validaciones!C243=\"\",\"\",Validaciones!C243)","v":"Personal con exposición a peligro por condición de seguridad, trabajo en alturas"},{"$f":"+IF(Validaciones!D243=\"\",\"\",Validaciones!D243)","v":"PRESENCIAL "},{"$f":"+IF(Validaciones!E243=\"\",\"\",Validaciones!E243)","v":"BOGOTÁ"},{"$f":"+IF(Validaciones!F243=\"\",\"\",Validaciones!F243)","v":"2019-01-01"},{"$f":"+IF(Validaciones!G243=\"\",\"\",Validaciones!G243)","v":"8:00 am - 5:00 pm\n20 HORAS\n"},{"$f":"+IF(Validaciones!H243=\"\",\"\",Validaciones!H243)","v":"Sede Complejo Cazuca – Autopista sur Carrera 4ª N° 53 – 54"},{"$f":"+IF(Validaciones!I243=\"\",\"\",Validaciones!I243)","v":"(en blanco)"},null,{"$f":"+IF(Validaciones!I245=\"\",\"\",Validaciones!I245)","v":"(en blanco)"},{"$f":"IF(B249=\"\",\"\",+VLOOKUP(B249,'PRESENCIAL NACIONAL - VIRTUALES'!C:N,12,0))","v":"SENA"}]
[{"$f":"+IF(Validaciones!A244=\"\",\"\",Validaciones!A244)","v":"TRABAJO EN ALTURA "},{"$f":"+IF(Validaciones!B244=\"\",\"\",Validaciones!B244)","v":"Entrenamiento para trabajos en alturas -  (Reentrenamiento)"},{"$f":"+IF(Validaciones!C244=\"\",\"\",Validaciones!C244)","v":"Personal con exposición a peligro por condición de seguridad, trabajo en alturas"},{"$f":"+IF(Validaciones!D244=\"\",\"\",Validaciones!D244)","v":"PRESENCIAL "},{"$f":"+IF(Validaciones!E244=\"\",\"\",Validaciones!E244)","v":"BOGOTÁ"},{"$f":"+IF(Validaciones!F244=\"\",\"\",Validaciones!F244)","v":"2019-03-01"},{"$f":"+IF(Validaciones!G244=\"\",\"\",Validaciones!G244)","v":"8:00 am - 5:00 pm\n20 HORAS\n"},{"$f":"+IF(Validaciones!H244=\"\",\"\",Validaciones!H244)","v":"Sede Complejo Cazuca – Autopista sur Carrera 4ª N° 53 – 54"},{"$f":"+IF(Validaciones!I244=\"\",\"\",Validaciones!I244)","v":"(en blanco)"},null,{"$f":"+IF(Validaciones!I246=\"\",\"\",Validaciones!I246)","v":"(en blanco)"},{"$f":"IF(B250=\"\",\"\",+VLOOKUP(B250,'PRESENCIAL NACIONAL - VIRTUALES'!C:N,12,0))","v":"SENA"}]
[{"$f":"+IF(Validaciones!A245=\"\",\"\",Validaciones!A245)","v":"TRABAJO EN ALTURA "},{"$f":"+IF(Validaciones!B245=\"\",\"\",Validaciones!B245)","v":"Entrenamiento para trabajos en alturas -  (Reentrenamiento)"},{"$f":"+IF(Validaciones!C245=\"\",\"\",Validaciones!C245)","v":"Personal con exposición a peligro por condición de seguridad, trabajo en alturas"},{"$f":"+IF(Validaciones!D245=\"\",\"\",Validaciones!D245)","v":"PRESENCIAL "},{"$f":"+IF(Validaciones!E245=\"\",\"\",Validaciones!E245)","v":"BOGOTÁ"},{"$f":"+IF(Validaciones!F245=\"\",\"\",Validaciones!F245)","v":"2019-04-01"},{"$f":"+IF(Validaciones!G245=\"\",\"\",Validaciones!G245)","v":"8:00 am - 5:00 pm\n20 HORAS\n"},{"$f":"+IF(Validaciones!H245=\"\",\"\",Validaciones!H245)","v":"Sede Complejo Cazuca – Autopista sur Carrera 4ª N° 53 – 54"},{"$f":"+IF(Validaciones!I245=\"\",\"\",Validaciones!I245)","v":"(en blanco)"},null,{"$f":"+IF(Validaciones!I247=\"\",\"\",Validaciones!I247)","v":"(en blanco)"},{"$f":"IF(B251=\"\",\"\",+VLOOKUP(B251,'PRESENCIAL NACIONAL - VIRTUALES'!C:N,12,0))","v":"SENA"}]
[{"$f":"+IF(Validaciones!A246=\"\",\"\",Validaciones!A246)","v":"TRABAJO EN ALTURA "},{"$f":"+IF(Validaciones!B246=\"\",\"\",Validaciones!B246)","v":"Entrenamiento para trabajos en alturas -  (Reentrenamiento)"},{"$f":"+IF(Validaciones!C246=\"\",\"\",Validaciones!C246)","v":"Personal con exposición a peligro por condición de seguridad, trabajo en alturas"},{"$f":"+IF(Validaciones!D246=\"\",\"\",Validaciones!D246)","v":"PRESENCIAL "},{"$f":"+IF(Validaciones!E246=\"\",\"\",Validaciones!E246)","v":"BOGOTÁ"},{"$f":"+IF(Validaciones!F246=\"\",\"\",Validaciones!F246)","v":"2019-05-01"},{"$f":"+IF(Validaciones!G246=\"\",\"\",Validaciones!G246)","v":"8:00 am - 5:00 pm\n20 HORAS\n"},{"$f":"+IF(Validaciones!H246=\"\",\"\",Validaciones!H246)","v":"Sede Complejo Cazuca – Autopista sur Carrera 4ª N° 53 – 54"},{"$f":"+IF(Validaciones!I246=\"\",\"\",Validaciones!I246)","v":"(en blanco)"},null,{"$f":"+IF(Validaciones!I248=\"\",\"\",Validaciones!I248)","v":"(en blanco)"},{"$f":"IF(B252=\"\",\"\",+VLOOKUP(B252,'PRESENCIAL NACIONAL - VIRTUALES'!C:N,12,0))","v":"SENA"}]
[{"$f":"+IF(Validaciones!A247=\"\",\"\",Validaciones!A247)","v":"TRABAJO EN ALTURA "},{"$f":"+IF(Validaciones!B247=\"\",\"\",Validaciones!B247)","v":"Entrenamiento para trabajos en alturas -  (Reentrenamiento)"},{"$f":"+IF(Validaciones!C247=\"\",\"\",Validaciones!C247)","v":"Personal con exposición a peligro por condición de seguridad, trabajo en alturas"},{"$f":"+IF(Validaciones!D247=\"\",\"\",Validaciones!D247)","v":"PRESENCIAL "},{"$f":"+IF(Validaciones!E247=\"\",\"\",Validaciones!E247)","v":"BOGOTÁ"},{"$f":"+IF(Validaciones!F247=\"\",\"\",Validaciones!F247)","v":"2019-06-01"},{"$f":"+IF(Validaciones!G247=\"\",\"\",Validaciones!G247)","v":"8:00 am - 5:00 pm\n20 HORAS\n"},{"$f":"+IF(Validaciones!H247=\"\",\"\",Validaciones!H247)","v":"Sede Complejo Cazuca – Autopista sur Carrera 4ª N° 53 – 54"},{"$f":"+IF(Validaciones!I247=\"\",\"\",Validaciones!I247)","v":"(en blanco)"},null,{"$f":"+IF(Validaciones!I249=\"\",\"\",Validaciones!I249)","v":"(en blanco)"},{"$f":"IF(B253=\"\",\"\",+VLOOKUP(B253,'PRESENCIAL NACIONAL - VIRTUALES'!C:N,12,0))","v":"SENA"}]
[{"$f":"+IF(Validaciones!A248=\"\",\"\",Validaciones!A248)","v":"TRABAJO EN ALTURA "},{"$f":"+IF(Validaciones!B248=\"\",\"\",Validaciones!B248)","v":"Entrenamiento para trabajos en alturas -  (Reentrenamiento)"},{"$f":"+IF(Validaciones!C248=\"\",\"\",Validaciones!C248)","v":"Personal con exposición a peligro por condición de seguridad, trabajo en alturas"},{"$f":"+IF(Validaciones!D248=\"\",\"\",Validaciones!D248)","v":"PRESENCIAL "},{"$f":"+IF(Validaciones!E248=\"\",\"\",Validaciones!E248)","v":"BOGOTÁ"},{"$f":"+IF(Validaciones!F248=\"\",\"\",Validaciones!F248)","v":"2019-07-01"},{"$f":"+IF(Validaciones!G248=\"\",\"\",Validaciones!G248)","v":"8:00 am - 5:00 pm\n20 HORAS\n"},{"$f":"+IF(Validaciones!H248=\"\",\"\",Validaciones!H248)","v":"Sede Complejo Cazuca – Autopista sur Carrera 4ª N° 53 – 54"},{"$f":"+IF(Validaciones!I248=\"\",\"\",Validaciones!I248)","v":"(en blanco)"},null,{"$f":"+IF(Validaciones!I250=\"\",\"\",Validaciones!I250)","v":"(en blanco)"},{"$f":"IF(B254=\"\",\"\",+VLOOKUP(B254,'PRESENCIAL NACIONAL - VIRTUALES'!C:N,12,0))","v":"SENA"}]
[{"$f":"+IF(Validaciones!A249=\"\",\"\",Validaciones!A249)","v":"TRABAJO EN ALTURA "},{"$f":"+IF(Validaciones!B249=\"\",\"\",Validaciones!B249)","v":"Entrenamiento para trabajos en alturas -  (Reentrenamiento)"},{"$f":"+IF(Validaciones!C249=\"\",\"\",Validaciones!C249)","v":"Personal con exposición a peligro por condición de seguridad, trabajo en alturas"},{"$f":"+IF(Validaciones!D249=\"\",\"\",Validaciones!D249)","v":"PRESENCIAL "},{"$f":"+IF(Validaciones!E249=\"\",\"\",Validaciones!E249)","v":"BOGOTÁ"},{"$f":"+IF(Validaciones!F249=\"\",\"\",Validaciones!F249)","v":"2019-08-01"},{"$f":"+IF(Validaciones!G249=\"\",\"\",Validaciones!G249)","v":"8:00 am - 5:00 pm\n20 HORAS\n"},{"$f":"+IF(Validaciones!H249=\"\",\"\",Validaciones!H249)","v":"Sede Complejo Cazuca – Autopista sur Carrera 4ª N° 53 – 54"},{"$f":"+IF(Validaciones!I249=\"\",\"\",Validaciones!I249)","v":"(en blanco)"},null,{"$f":"+IF(Validaciones!I251=\"\",\"\",Validaciones!I251)","v":"(en blanco)"},{"$f":"IF(B255=\"\",\"\",+VLOOKUP(B255,'PRESENCIAL NACIONAL - VIRTUALES'!C:N,12,0))","v":"SENA"}]
[{"$f":"+IF(Validaciones!A250=\"\",\"\",Validaciones!A250)","v":"TRABAJO EN ALTURA "},{"$f":"+IF(Validaciones!B250=\"\",\"\",Validaciones!B250)","v":"Entrenamiento para trabajos en alturas -  (Reentrenamiento)"},{"$f":"+IF(Validaciones!C250=\"\",\"\",Validaciones!C250)","v":"Personal con exposición a peligro por condición de seguridad, trabajo en alturas"},{"$f":"+IF(Validaciones!D250=\"\",\"\",Validaciones!D250)","v":"PRESENCIAL "},{"$f":"+IF(Validaciones!E250=\"\",\"\",Validaciones!E250)","v":"BOGOTÁ"},{"$f":"+IF(Validaciones!F250=\"\",\"\",Validaciones!F250)","v":"2018-09-01"},{"$f":"+IF(Validaciones!G250=\"\",\"\",Validaciones!G250)","v":"8:00 am - 5:00 pm\n20 HORAS\n"},{"$f":"+IF(Validaciones!H250=\"\",\"\",Validaciones!H250)","v":"Sede Complejo Cazuca – Autopista sur Carrera 4ª N° 53 – 54"},{"$f":"+IF(Validaciones!I250=\"\",\"\",Validaciones!I250)","v":"(en blanco)"},null,{"$f":"+IF(Validaciones!I252=\"\",\"\",Validaciones!I252)","v":"(en blanco)"},{"$f":"IF(B256=\"\",\"\",+VLOOKUP(B256,'PRESENCIAL NACIONAL - VIRTUALES'!C:N,12,0))","v":"SENA"}]
[{"$f":"+IF(Validaciones!A251=\"\",\"\",Validaciones!A251)","v":"TRABAJO EN ALTURA "},{"$f":"+IF(Validaciones!B251=\"\",\"\",Validaciones!B251)","v":"Entrenamiento para trabajos en alturas -  (Reentrenamiento)"},{"$f":"+IF(Validaciones!C251=\"\",\"\",Validaciones!C251)","v":"Personal con exposición a peligro por condición de seguridad, trabajo en alturas"},{"$f":"+IF(Validaciones!D251=\"\",\"\",Validaciones!D251)","v":"PRESENCIAL "},{"$f":"+IF(Validaciones!E251=\"\",\"\",Validaciones!E251)","v":"BOGOTÁ"},{"$f":"+IF(Validaciones!F251=\"\",\"\",Validaciones!F251)","v":"2019-10-01"},{"$f":"+IF(Validaciones!G251=\"\",\"\",Validaciones!G251)","v":"8:00 am - 5:00 pm\n20 HORAS\n"},{"$f":"+IF(Validaciones!H251=\"\",\"\",Validaciones!H251)","v":"Sede Complejo Cazuca – Autopista sur Carrera 4ª N° 53 – 54"},{"$f":"+IF(Validaciones!I251=\"\",\"\",Validaciones!I251)","v":"(en blanco)"},null,{"$f":"+IF(Validaciones!I253=\"\",\"\",Validaciones!I253)","v":"(en blanco)"},{"$f":"IF(B257=\"\",\"\",+VLOOKUP(B257,'PRESENCIAL NACIONAL - VIRTUALES'!C:N,12,0))","v":"SENA"}]
[{"$f":"+IF(Validaciones!A252=\"\",\"\",Validaciones!A252)","v":"TRABAJO EN ALTURA "},{"$f":"+IF(Validaciones!B252=\"\",\"\",Validaciones!B252)","v":"Entrenamiento para trabajos en alturas -  (Reentrenamiento)"},{"$f":"+IF(Validaciones!C252=\"\",\"\",Validaciones!C252)","v":"Personal con exposición a peligro por condición de seguridad, trabajo en alturas"},{"$f":"+IF(Validaciones!D252=\"\",\"\",Validaciones!D252)","v":"PRESENCIAL "},{"$f":"+IF(Validaciones!E252=\"\",\"\",Validaciones!E252)","v":"BOGOTÁ"},{"$f":"+IF(Validaciones!F252=\"\",\"\",Validaciones!F252)","v":"2019-11-01"},{"$f":"+IF(Validaciones!G252=\"\",\"\",Validaciones!G252)","v":"8:00 am - 5:00 pm\n20 HORAS\n"},{"$f":"+IF(Validaciones!H252=\"\",\"\",Validaciones!H252)","v":"Sede Complejo Cazuca – Autopista sur Carrera 4ª N° 53 – 54"},{"$f":"+IF(Validaciones!I252=\"\",\"\",Validaciones!I252)","v":"(en blanco)"},null,{"$f":"+IF(Validaciones!I254=\"\",\"\",Validaciones!I254)","v":"(en blanco)"},{"$f":"IF(B258=\"\",\"\",+VLOOKUP(B258,'PRESENCIAL NACIONAL - VIRTUALES'!C:N,12,0))","v":"SENA"}]
[{"$f":"+IF(Validaciones!A253=\"\",\"\",Validaciones!A253)","v":"TRABAJO EN ALTURA "},{"$f":"+IF(Validaciones!B253=\"\",\"\",Validaciones!B253)","v":"Entrenamiento para trabajos en alturas -  (Reentrenamiento)"},{"$f":"+IF(Validaciones!C253=\"\",\"\",Validaciones!C253)","v":"Personal con exposición a peligro por condición de seguridad, trabajo en alturas"},{"$f":"+IF(Validaciones!D253=\"\",\"\",Validaciones!D253)","v":"PRESENCIAL "},{"$f":"+IF(Validaciones!E253=\"\",\"\",Validaciones!E253)","v":"BOGOTÁ"},{"$f":"+IF(Validaciones!F253=\"\",\"\",Validaciones!F253)","v":"2019-12-01"},{"$f":"+IF(Validaciones!G253=\"\",\"\",Validaciones!G253)","v":"8:00 am - 5:00 pm\n20 HORAS\n"},{"$f":"+IF(Validaciones!H253=\"\",\"\",Validaciones!H253)","v":"Sede Complejo Cazuca – Autopista sur Carrera 4ª N° 53 – 54"},{"$f":"+IF(Validaciones!I253=\"\",\"\",Validaciones!I253)","v":"(en blanco)"},null,{"$f":"+IF(Validaciones!I255=\"\",\"\",Validaciones!I255)","v":"(en blanco)"},{"$f":"IF(B259=\"\",\"\",+VLOOKUP(B259,'PRESENCIAL NACIONAL - VIRTUALES'!C:N,12,0))","v":"SENA"}]
[{"$f":"+IF(Validaciones!A254=\"\",\"\",Validaciones!A254)","v":"TRABAJO EN ALTURA "},{"$f":"+IF(Validaciones!B254=\"\",\"\",Validaciones!B254)","v":"Entrenamiento para trabajos en alturas (Avanzado) - Nivel Avanzado: 40 horas; de las cuales mínimo 16 serán teóricas y 24 de entrenamiento práctico"},{"$f":"+IF(Validaciones!C254=\"\",\"\",Validaciones!C254)","v":"Personal con exposición a peligro por condición de seguridad, trabajo en alturas"},{"$f":"+IF(Validaciones!D254=\"\",\"\",Validaciones!D254)","v":"PRESENCIAL "},{"$f":"+IF(Validaciones!E254=\"\",\"\",Validaciones!E254)","v":"BOGOTÁ"},{"$f":"+IF(Validaciones!F254=\"\",\"\",Validaciones!F254)","v":"2019-02-01"},{"$f":"+IF(Validaciones!G254=\"\",\"\",Validaciones!G254)","v":"8:00 am - 5:00 pm\n40 HORAS\n"},{"$f":"+IF(Validaciones!H254=\"\",\"\",Validaciones!H254)","v":"Sede Complejo Cazuca – Autopista sur Carrera 4ª N° 53 – 54"},{"$f":"+IF(Validaciones!I254=\"\",\"\",Validaciones!I254)","v":"(en blanco)"},null,{"$f":"+IF(Validaciones!I256=\"\",\"\",Validaciones!I256)","v":"(en blanco)"},{"$f":"IF(B260=\"\",\"\",+VLOOKUP(B260,'PRESENCIAL NACIONAL - VIRTUALES'!C:N,12,0))","v":"SENA"}]
[{"$f":"+IF(Validaciones!A255=\"\",\"\",Validaciones!A255)","v":"TRABAJO EN ALTURA "},{"$f":"+IF(Validaciones!B255=\"\",\"\",Validaciones!B255)","v":"Entrenamiento para trabajos en alturas (Avanzado) - Nivel Avanzado: 40 horas; de las cuales mínimo 16 serán teóricas y 24 de entrenamiento práctico"},{"$f":"+IF(Validaciones!C255=\"\",\"\",Validaciones!C255)","v":"Personal con exposición a peligro por condición de seguridad, trabajo en alturas"},{"$f":"+IF(Validaciones!D255=\"\",\"\",Validaciones!D255)","v":"PRESENCIAL "},{"$f":"+IF(Validaciones!E255=\"\",\"\",Validaciones!E255)","v":"BOGOTÁ"},{"$f":"+IF(Validaciones!F255=\"\",\"\",Validaciones!F255)","v":"2019-01-01"},{"$f":"+IF(Validaciones!G255=\"\",\"\",Validaciones!G255)","v":"8:00 am - 5:00 pm\n40 HORAS\n"},{"$f":"+IF(Validaciones!H255=\"\",\"\",Validaciones!H255)","v":"Sede Complejo Cazuca – Autopista sur Carrera 4ª N° 53 – 54"},{"$f":"+IF(Validaciones!I255=\"\",\"\",Validaciones!I255)","v":"(en blanco)"},null,{"$f":"+IF(Validaciones!I257=\"\",\"\",Validaciones!I257)","v":"(en blanco)"},{"$f":"IF(B261=\"\",\"\",+VLOOKUP(B261,'PRESENCIAL NACIONAL - VIRTUALES'!C:N,12,0))","v":"SENA"}]
[{"$f":"+IF(Validaciones!A256=\"\",\"\",Validaciones!A256)","v":"TRABAJO EN ALTURA "},{"$f":"+IF(Validaciones!B256=\"\",\"\",Validaciones!B256)","v":"Entrenamiento para trabajos en alturas (Avanzado) - Nivel Avanzado: 40 horas; de las cuales mínimo 16 serán teóricas y 24 de entrenamiento práctico"},{"$f":"+IF(Validaciones!C256=\"\",\"\",Validaciones!C256)","v":"Personal con exposición a peligro por condición de seguridad, trabajo en alturas"},{"$f":"+IF(Validaciones!D256=\"\",\"\",Validaciones!D256)","v":"PRESENCIAL "},{"$f":"+IF(Validaciones!E256=\"\",\"\",Validaciones!E256)","v":"BOGOTÁ"},{"$f":"+IF(Validaciones!F256=\"\",\"\",Validaciones!F256)","v":"2019-03-01"},{"$f":"+IF(Validaciones!G256=\"\",\"\",Validaciones!G256)","v":"8:00 am - 5:00 pm\n40 HORAS\n"},{"$f":"+IF(Validaciones!H256=\"\",\"\",Validaciones!H256)","v":"Sede Complejo Cazuca – Autopista sur Carrera 4ª N° 53 – 54"},{"$f":"+IF(Validaciones!I256=\"\",\"\",Validaciones!I256)","v":"(en blanco)"},null,{"$f":"+IF(Validaciones!I258=\"\",\"\",Validaciones!I258)","v":"(en blanco)"},{"$f":"IF(B262=\"\",\"\",+VLOOKUP(B262,'PRESENCIAL NACIONAL - VIRTUALES'!C:N,12,0))","v":"SENA"}]
[{"$f":"+IF(Validaciones!A257=\"\",\"\",Validaciones!A257)","v":"TRABAJO EN ALTURA "},{"$f":"+IF(Validaciones!B257=\"\",\"\",Validaciones!B257)","v":"Entrenamiento para trabajos en alturas (Avanzado) - Nivel Avanzado: 40 horas; de las cuales mínimo 16 serán teóricas y 24 de entrenamiento práctico"},{"$f":"+IF(Validaciones!C257=\"\",\"\",Validaciones!C257)","v":"Personal con exposición a peligro por condición de seguridad, trabajo en alturas"},{"$f":"+IF(Validaciones!D257=\"\",\"\",Validaciones!D257)","v":"PRESENCIAL "},{"$f":"+IF(Validaciones!E257=\"\",\"\",Validaciones!E257)","v":"BOGOTÁ"},{"$f":"+IF(Validaciones!F257=\"\",\"\",Validaciones!F257)","v":"2019-04-01"},{"$f":"+IF(Validaciones!G257=\"\",\"\",Validaciones!G257)","v":"8:00 am - 5:00 pm\n40 HORAS\n"},{"$f":"+IF(Validaciones!H257=\"\",\"\",Validaciones!H257)","v":"Sede Complejo Cazuca – Autopista sur Carrera 4ª N° 53 – 54"},{"$f":"+IF(Validaciones!I257=\"\",\"\",Validaciones!I257)","v":"(en blanco)"},null,{"$f":"+IF(Validaciones!I259=\"\",\"\",Validaciones!I259)","v":"(en blanco)"},{"$f":"IF(B263=\"\",\"\",+VLOOKUP(B263,'PRESENCIAL NACIONAL - VIRTUALES'!C:N,12,0))","v":"SENA"}]
[{"$f":"+IF(Validaciones!A258=\"\",\"\",Validaciones!A258)","v":"TRABAJO EN ALTURA "},{"$f":"+IF(Validaciones!B258=\"\",\"\",Validaciones!B258)","v":"Entrenamiento para trabajos en alturas (Avanzado) - Nivel Avanzado: 40 horas; de las cuales mínimo 16 serán teóricas y 24 de entrenamiento práctico"},{"$f":"+IF(Validaciones!C258=\"\",\"\",Validaciones!C258)","v":"Personal con exposición a peligro por condición de seguridad, trabajo en alturas"},{"$f":"+IF(Validaciones!D258=\"\",\"\",Validaciones!D258)","v":"PRESENCIAL "},{"$f":"+IF(Validaciones!E258=\"\",\"\",Validaciones!E258)","v":"BOGOTÁ"},{"$f":"+IF(Validaciones!F258=\"\",\"\",Validaciones!F258)","v":"2019-05-01"},{"$f":"+IF(Validaciones!G258=\"\",\"\",Validaciones!G258)","v":"8:00 am - 5:00 pm\n40 HORAS\n"},{"$f":"+IF(Validaciones!H258=\"\",\"\",Validaciones!H258)","v":"Sede Complejo Cazuca – Autopista sur Carrera 4ª N° 53 – 54"},{"$f":"+IF(Validaciones!I258=\"\",\"\",Validaciones!I258)","v":"(en blanco)"},null,{"$f":"+IF(Validaciones!I260=\"\",\"\",Validaciones!I260)","v":"(en blanco)"},{"$f":"IF(B264=\"\",\"\",+VLOOKUP(B264,'PRESENCIAL NACIONAL - VIRTUALES'!C:N,12,0))","v":"SENA"}]
[{"$f":"+IF(Validaciones!A259=\"\",\"\",Validaciones!A259)","v":"TRABAJO EN ALTURA "},{"$f":"+IF(Validaciones!B259=\"\",\"\",Validaciones!B259)","v":"Entrenamiento para trabajos en alturas (Avanzado) - Nivel Avanzado: 40 horas; de las cuales mínimo 16 serán teóricas y 24 de entrenamiento práctico"},{"$f":"+IF(Validaciones!C259=\"\",\"\",Validaciones!C259)","v":"Personal con exposición a peligro por condición de seguridad, trabajo en alturas"},{"$f":"+IF(Validaciones!D259=\"\",\"\",Validaciones!D259)","v":"PRESENCIAL "},{"$f":"+IF(Validaciones!E259=\"\",\"\",Validaciones!E259)","v":"BOGOTÁ"},{"$f":"+IF(Validaciones!F259=\"\",\"\",Validaciones!F259)","v":"2019-06-01"},{"$f":"+IF(Validaciones!G259=\"\",\"\",Validaciones!G259)","v":"8:00 am - 5:00 pm\n40 HORAS\n"},{"$f":"+IF(Validaciones!H259=\"\",\"\",Validaciones!H259)","v":"Sede Complejo Cazuca – Autopista sur Carrera 4ª N° 53 – 54"},{"$f":"+IF(Validaciones!I259=\"\",\"\",Validaciones!I259)","v":"(en blanco)"},null,{"$f":"+IF(Validaciones!I261=\"\",\"\",Validaciones!I261)","v":"(en blanco)"},{"$f":"IF(B265=\"\",\"\",+VLOOKUP(B265,'PRESENCIAL NACIONAL - VIRTUALES'!C:N,12,0))","v":"SENA"}]
[{"$f":"+IF(Validaciones!A260=\"\",\"\",Validaciones!A260)","v":"TRABAJO EN ALTURA "},{"$f":"+IF(Validaciones!B260=\"\",\"\",Validaciones!B260)","v":"Entrenamiento para trabajos en alturas (Avanzado) - Nivel Avanzado: 40 horas; de las cuales mínimo 16 serán teóricas y 24 de entrenamiento práctico"},{"$f":"+IF(Validaciones!C260=\"\",\"\",Validaciones!C260)","v":"Personal con exposición a peligro por condición de seguridad, trabajo en alturas"},{"$f":"+IF(Validaciones!D260=\"\",\"\",Validaciones!D260)","v":"PRESENCIAL "},{"$f":"+IF(Validaciones!E260=\"\",\"\",Validaciones!E260)","v":"BOGOTÁ"},{"$f":"+IF(Validaciones!F260=\"\",\"\",Validaciones!F260)","v":"2019-07-01"},{"$f":"+IF(Validaciones!G260=\"\",\"\",Validaciones!G260)","v":"8:00 am - 5:00 pm\n40 HORAS\n"},{"$f":"+IF(Validaciones!H260=\"\",\"\",Validaciones!H260)","v":"Sede Complejo Cazuca – Autopista sur Carrera 4ª N° 53 – 54"},{"$f":"+IF(Validaciones!I260=\"\",\"\",Validaciones!I260)","v":"(en blanco)"},null,{"$f":"+IF(Validaciones!I262=\"\",\"\",Validaciones!I262)","v":"(en blanco)"},{"$f":"IF(B266=\"\",\"\",+VLOOKUP(B266,'PRESENCIAL NACIONAL - VIRTUALES'!C:N,12,0))","v":"SENA"}]
[{"$f":"+IF(Validaciones!A261=\"\",\"\",Validaciones!A261)","v":"TRABAJO EN ALTURA "},{"$f":"+IF(Validaciones!B261=\"\",\"\",Validaciones!B261)","v":"Entrenamiento para trabajos en alturas (Avanzado) - Nivel Avanzado: 40 horas; de las cuales mínimo 16 serán teóricas y 24 de entrenamiento práctico"},{"$f":"+IF(Validaciones!C261=\"\",\"\",Validaciones!C261)","v":"Personal con exposición a peligro por condición de seguridad, trabajo en alturas"},{"$f":"+IF(Validaciones!D261=\"\",\"\",Validaciones!D261)","v":"PRESENCIAL "},{"$f":"+IF(Validaciones!E261=\"\",\"\",Validaciones!E261)","v":"BOGOTÁ"},{"$f":"+IF(Validaciones!F261=\"\",\"\",Validaciones!F261)","v":"2019-08-01"},{"$f":"+IF(Validaciones!G261=\"\",\"\",Validaciones!G261)","v":"8:00 am - 5:00 pm\n40 HORAS\n"},{"$f":"+IF(Validaciones!H261=\"\",\"\",Validaciones!H261)","v":"Sede Complejo Cazuca – Autopista sur Carrera 4ª N° 53 – 54"},{"$f":"+IF(Validaciones!I261=\"\",\"\",Validaciones!I261)","v":"(en blanco)"},null,{"$f":"+IF(Validaciones!I263=\"\",\"\",Validaciones!I263)","v":"(en blanco)"},{"$f":"IF(B267=\"\",\"\",+VLOOKUP(B267,'PRESENCIAL NACIONAL - VIRTUALES'!C:N,12,0))","v":"SENA"}]
[{"$f":"+IF(Validaciones!A262=\"\",\"\",Validaciones!A262)","v":"TRABAJO EN ALTURA "},{"$f":"+IF(Validaciones!B262=\"\",\"\",Validaciones!B262)","v":"Entrenamiento para trabajos en alturas (Avanzado) - Nivel Avanzado: 40 horas; de las cuales mínimo 16 serán teóricas y 24 de entrenamiento práctico"},{"$f":"+IF(Validaciones!C262=\"\",\"\",Validaciones!C262)","v":"Personal con exposición a peligro por condición de seguridad, trabajo en alturas"},{"$f":"+IF(Validaciones!D262=\"\",\"\",Validaciones!D262)","v":"PRESENCIAL "},{"$f":"+IF(Validaciones!E262=\"\",\"\",Validaciones!E262)","v":"BOGOTÁ"},{"$f":"+IF(Validaciones!F262=\"\",\"\",Validaciones!F262)","v":"2018-09-01"},{"$f":"+IF(Validaciones!G262=\"\",\"\",Validaciones!G262)","v":"8:00 am - 5:00 pm\n40 HORAS\n"},{"$f":"+IF(Validaciones!H262=\"\",\"\",Validaciones!H262)","v":"Sede Complejo Cazuca – Autopista sur Carrera 4ª N° 53 – 54"},{"$f":"+IF(Validaciones!I262=\"\",\"\",Validaciones!I262)","v":"(en blanco)"},null,{"$f":"+IF(Validaciones!I264=\"\",\"\",Validaciones!I264)","v":"(en blanco)"},{"$f":"IF(B268=\"\",\"\",+VLOOKUP(B268,'PRESENCIAL NACIONAL - VIRTUALES'!C:N,12,0))","v":"SENA"}]
[{"$f":"+IF(Validaciones!A263=\"\",\"\",Validaciones!A263)","v":"TRABAJO EN ALTURA "},{"$f":"+IF(Validaciones!B263=\"\",\"\",Validaciones!B263)","v":"Entrenamiento para trabajos en alturas (Avanzado) - Nivel Avanzado: 40 horas; de las cuales mínimo 16 serán teóricas y 24 de entrenamiento práctico"},{"$f":"+IF(Validaciones!C263=\"\",\"\",Validaciones!C263)","v":"Personal con exposición a peligro por condición de seguridad, trabajo en alturas"},{"$f":"+IF(Validaciones!D263=\"\",\"\",Validaciones!D263)","v":"PRESENCIAL "},{"$f":"+IF(Validaciones!E263=\"\",\"\",Validaciones!E263)","v":"BOGOTÁ"},{"$f":"+IF(Validaciones!F263=\"\",\"\",Validaciones!F263)","v":"2019-10-01"},{"$f":"+IF(Validaciones!G263=\"\",\"\",Validaciones!G263)","v":"8:00 am - 5:00 pm\n40 HORAS\n"},{"$f":"+IF(Validaciones!H263=\"\",\"\",Validaciones!H263)","v":"Sede Complejo Cazuca – Autopista sur Carrera 4ª N° 53 – 54"},{"$f":"+IF(Validaciones!I263=\"\",\"\",Validaciones!I263)","v":"(en blanco)"},null,{"$f":"+IF(Validaciones!I265=\"\",\"\",Validaciones!I265)","v":"(en blanco)"},{"$f":"IF(B269=\"\",\"\",+VLOOKUP(B269,'PRESENCIAL NACIONAL - VIRTUALES'!C:N,12,0))","v":"SENA"}]
[{"$f":"+IF(Validaciones!A264=\"\",\"\",Validaciones!A264)","v":"TRABAJO EN ALTURA "},{"$f":"+IF(Validaciones!B264=\"\",\"\",Validaciones!B264)","v":"Entrenamiento para trabajos en alturas (Avanzado) - Nivel Avanzado: 40 horas; de las cuales mínimo 16 serán teóricas y 24 de entrenamiento práctico"},{"$f":"+IF(Validaciones!C264=\"\",\"\",Validaciones!C264)","v":"Personal con exposición a peligro por condición de seguridad, trabajo en alturas"},{"$f":"+IF(Validaciones!D264=\"\",\"\",Validaciones!D264)","v":"PRESENCIAL "},{"$f":"+IF(Validaciones!E264=\"\",\"\",Validaciones!E264)","v":"BOGOTÁ"},{"$f":"+IF(Validaciones!F264=\"\",\"\",Validaciones!F264)","v":"2019-12-01"},{"$f":"+IF(Validaciones!G264=\"\",\"\",Validaciones!G264)","v":"8:00 am - 5:00 pm\n40 HORAS\n"},{"$f":"+IF(Validaciones!H264=\"\",\"\",Validaciones!H264)","v":"Sede Complejo Cazuca – Autopista sur Carrera 4ª N° 53 – 54"},{"$f":"+IF(Validaciones!I264=\"\",\"\",Validaciones!I264)","v":"(en blanco)"},null,{"$f":"+IF(Validaciones!I266=\"\",\"\",Validaciones!I266)","v":"(en blanco)"},{"$f":"IF(B270=\"\",\"\",+VLOOKUP(B270,'PRESENCIAL NACIONAL - VIRTUALES'!C:N,12,0))","v":"SENA"}]
[{"$f":"+IF(Validaciones!A265=\"\",\"\",Validaciones!A265)","v":"(en blanco)"},{"$f":"+IF(Validaciones!B265=\"\",\"\",Validaciones!B265)","v":"(en blanco)"},{"$f":"+IF(Validaciones!C265=\"\",\"\",Validaciones!C265)","v":"(en blanco)"},{"$f":"+IF(Validaciones!D265=\"\",\"\",Validaciones!D265)","v":"(en blanco)"},{"$f":"+IF(Validaciones!E265=\"\",\"\",Validaciones!E265)","v":"(en blanco)"},{"$f":"+IF(Validaciones!F265=\"\",\"\",Validaciones!F265)","v":"(en blanco)"},{"$f":"+IF(Validaciones!G265=\"\",\"\",Validaciones!G265)","v":"(en blanco)"},{"$f":"+IF(Validaciones!H265=\"\",\"\",Validaciones!H265)","v":"(en blanco)"},{"$f":"+IF(Validaciones!I265=\"\",\"\",Validaciones!I265)","v":"(en blanco)"},null,{"$f":"+IF(Validaciones!I267=\"\",\"\",Validaciones!I267)","v":200},{"$f":"IF(B271=\"\",\"\",+VLOOKUP(B271,'PRESENCIAL NACIONAL - VIRTUALES'!C:N,12,0))","v":{"$error":"#N/A"}}]
[{"$f":"+IF(Validaciones!A266=\"\",\"\",Validaciones!A266)","v":"(en blanco)"},{"$f":"+IF(Validaciones!B266=\"\",\"\",Validaciones!B266)","v":"(en blanco)"},{"$f":"+IF(Validaciones!C266=\"\",\"\",Validaciones!C266)","v":"(en blanco)"},{"$f":"+IF(Validaciones!D266=\"\",\"\",Validaciones!D266)","v":"(en blanco)"},{"$f":"+IF(Validaciones!E266=\"\",\"\",Validaciones!E266)","v":"(en blanco)"},{"$f":"+IF(Validaciones!F266=\"\",\"\",Validaciones!F266)","v":"ver"},{"$f":"+IF(Validaciones!G266=\"\",\"\",Validaciones!G266)","v":"(en blanco)"},{"$f":"+IF(Validaciones!H266=\"\",\"\",Validaciones!H266)","v":"(en blanco)"},{"$f":"+IF(Validaciones!I266=\"\",\"\",Validaciones!I266)","v":"(en blanco)"},null,{"$f":"+IF(Validaciones!I268=\"\",\"\",Validaciones!I268)","v":"(en blanco)"},{"$f":"IF(B272=\"\",\"\",+VLOOKUP(B272,'PRESENCIAL NACIONAL - VIRTUALES'!C:N,12,0))","v":{"$error":"#N/A"}}]
[{"$f":"+IF(Validaciones!A267=\"\",\"\",Validaciones!A267)","v":"ERGONOMIA"},{"$f":"+IF(Validaciones!B267=\"\",\"\",Validaciones!B267)","v":"Curso Ergonomía"},{"$f":"+IF(Validaciones!C267=\"\",\"\",Validaciones!C267)","v":"Personal con exposición a peligro biomecanico y responsable de SG - SST "},{"$f":"+IF(Validaciones!D267=\"\",\"\",Validaciones!D267)","v":"VIRTUAL "},{"$f":"+IF(Validaciones!E267=\"\",\"\",Validaciones!E267)","v":"NACIONAL"},{"$f":"+IF(Validaciones!F267=\"\",\"\",Validaciones!F267)","v":"2019-10-31"},{"$f":"+IF(Validaciones!G267=\"\",\"\",Validaciones!G267)","v":"Abierto "},{"$f":"+IF(Validaciones!H267=\"\",\"\",Validaciones!H267)","v":"Liberty University"},{"$f":"+IF(Validaciones!I267=\"\",\"\",Validaciones!I267)","v":200},null,{"$f":"+IF(Validaciones!I269=\"\",\"\",Validaciones!I269)","v":"(en blanco)"},{"$f":"IF(B273=\"\",\"\",+VLOOKUP(B273,'PRESENCIAL NACIONAL - VIRTUALES'!C:N,12,0))","v":0}]
[{"$f":"+IF(Validaciones!A268=\"\",\"\",Validaciones!A268)","v":"LIBERTY MUTUAL "},{"$f":"+IF(Validaciones!B268=\"\",\"\",Validaciones!B268)","v":"Construction Safety Tools - Just a Click Away"},{"$f":"+IF(Validaciones!C268=\"\",\"\",Validaciones!C268)","v":"Requisito manejo del Inglés"},{"$f":"+IF(Validaciones!D268=\"\",\"\",Validaciones!D268)","v":"VIRTUAL "},{"$f":"+IF(Validaciones!E268=\"\",\"\",Validaciones!E268)","v":"NACIONAL"},{"$f":"+IF(Validaciones!F268=\"\",\"\",Validaciones!F268)","v":"2019-02-07"},{"$f":"+IF(Validaciones!G268=\"\",\"\",Validaciones!G268)","v":"2:00 - 3:00 p.m."},{"$f":"+IF(Validaciones!H268=\"\",\"\",Validaciones!H268)","v":"LIBERTY MUTUAL"},{"$f":"+IF(Validaciones!I268=\"\",\"\",Validaciones!I268)","v":"(en blanco)"},null,{"$f":"+IF(Validaciones!I270=\"\",\"\",Validaciones!I270)","v":"(en blanco)"},{"$f":"IF(B274=\"\",\"\",+VLOOKUP(B274,'PRESENCIAL NACIONAL - VIRTUALES'!C:N,12,0))","v":0}]
[{"$f":"+IF(Validaciones!A269=\"\",\"\",Validaciones!A269)","v":"LIBERTY MUTUAL "},{"$f":"+IF(Validaciones!B269=\"\",\"\",Validaciones!B269)","v":"Risk Control Services: A Virtual Overview"},{"$f":"+IF(Validaciones!C269=\"\",\"\",Validaciones!C269)","v":"Requisito manejo del Inglés"},{"$f":"+IF(Validaciones!D269=\"\",\"\",Validaciones!D269)","v":"VIRTUAL "},{"$f":"+IF(Validaciones!E269=\"\",\"\",Validaciones!E269)","v":"NACIONAL"},{"$f":"+IF(Validaciones!F269=\"\",\"\",Validaciones!F269)","v":"2019-03-05"},{"$f":"+IF(Validaciones!G269=\"\",\"\",Validaciones!G269)","v":"2:00 - 3:00 p.m."},{"$f":"+IF(Validaciones!H269=\"\",\"\",Validaciones!H269)","v":"LIBERTY MUTUAL"},{"$f":"+IF(Validaciones!I269=\"\",\"\",Validaciones!I269)","v":"(en blanco)"},null,{"$f":"+IF(Validaciones!I271=\"\",\"\",Validaciones!I271)","v":"(en blanco)"},{"$f":"IF(B275=\"\",\"\",+VLOOKUP(B275,'PRESENCIAL NACIONAL - VIRTUALES'!C:N,12,0))","v":0}]
[{"$f":"+IF(Validaciones!A270=\"\",\"\",Validaciones!A270)","v":"LIBERTY MUTUAL "},{"$f":"+IF(Validaciones!B270=\"\",\"\",Validaciones!B270)","v":"Risk Control Services: A Virtual Overview"},{"$f":"+IF(Validaciones!C270=\"\",\"\",Validaciones!C270)","v":"Requisito manejo del Inglés"},{"$f":"+IF(Validaciones!D270=\"\",\"\",Validaciones!D270)","v":"VIRTUAL "},{"$f":"+IF(Validaciones!E270=\"\",\"\",Validaciones!E270)","v":"NACIONAL"},{"$f":"+IF(Validaciones!F270=\"\",\"\",Validaciones!F270)","v":"2019-09-05"},{"$f":"+IF(Validaciones!G270=\"\",\"\",Validaciones!G270)","v":"2:00 - 3:00 p.m."},{"$f":"+IF(Validaciones!H270=\"\",\"\",Validaciones!H270)","v":"LIBERTY MUTUAL"},{"$f":"+IF(Validaciones!I270=\"\",\"\",Validaciones!I270)","v":"(en blanco)"},null,{"$f":"+IF(Validaciones!I272=\"\",\"\",Validaciones!I272)","v":"(en blanco)"},{"$f":"IF(B276=\"\",\"\",+VLOOKUP(B276,'PRESENCIAL NACIONAL - VIRTUALES'!C:N,12,0))","v":0}]
[{"$f":"+IF(Validaciones!A271=\"\",\"\",Validaciones!A271)","v":"LIBERTY MUTUAL "},{"$f":"+IF(Validaciones!B271=\"\",\"\",Validaciones!B271)","v":"Safe Patient/Resident Mobilization"},{"$f":"+IF(Validaciones!C271=\"\",\"\",Validaciones!C271)","v":"Requisito manejo del Inglés"},{"$f":"+IF(Validaciones!D271=\"\",\"\",Validaciones!D271)","v":"VIRTUAL "},{"$f":"+IF(Validaciones!E271=\"\",\"\",Validaciones!E271)","v":"NACIONAL"},{"$f":"+IF(Validaciones!F271=\"\",\"\",Validaciones!F271)","v":"2019-03-13"},{"$f":"+IF(Validaciones!G271=\"\",\"\",Validaciones!G271)","v":"2:00 - 3:00 p.m."},{"$f":"+IF(Validaciones!H271=\"\",\"\",Validaciones!H271)","v":"LIBERTY MUTUAL"},{"$f":"+IF(Validaciones!I271=\"\",\"\",Validaciones!I271)","v":"(en blanco)"},null,{"$f":"+IF(Validaciones!I273=\"\",\"\",Validaciones!I273)","v":"(en blanco)"},{"$f":"IF(B277=\"\",\"\",+VLOOKUP(B277,'PRESENCIAL NACIONAL - VIRTUALES'!C:N,12,0))","v":0}]
[{"$f":"+IF(Validaciones!A272=\"\",\"\",Validaciones!A272)","v":"LIBERTY MUTUAL "},{"$f":"+IF(Validaciones!B272=\"\",\"\",Validaciones!B272)","v":"Silica: Competent Person and Control Plan Development"},{"$f":"+IF(Validaciones!C272=\"\",\"\",Validaciones!C272)","v":"Requisito manejo del Inglés"},{"$f":"+IF(Validaciones!D272=\"\",\"\",Validaciones!D272)","v":"VIRTUAL "},{"$f":"+IF(Validaciones!E272=\"\",\"\",Validaciones!E272)","v":"NACIONAL"},{"$f":"+IF(Validaciones!F272=\"\",\"\",Validaciones!F272)","v":"2019-03-21"},{"$f":"+IF(Validaciones!G272=\"\",\"\",Validaciones!G272)","v":"2:00 - 3:00 p.m."},{"$f":"+IF(Validaciones!H272=\"\",\"\",Validaciones!H272)","v":"LIBERTY MUTUAL"},{"$f":"+IF(Validaciones!I272=\"\",\"\",Validaciones!I272)","v":"(en blanco)"},null,{"$f":"+IF(Validaciones!I274=\"\",\"\",Validaciones!I274)","v":"(en blanco)"},{"$f":"IF(B278=\"\",\"\",+VLOOKUP(B278,'PRESENCIAL NACIONAL - VIRTUALES'!C:N,12,0))","v":0}]
[{"$f":"+IF(Validaciones!A273=\"\",\"\",Validaciones!A273)","v":"LIBERTY MUTUAL "},{"$f":"+IF(Validaciones!B273=\"\",\"\",Validaciones!B273)","v":"Silica: Competent Person and Control Plan Development"},{"$f":"+IF(Validaciones!C273=\"\",\"\",Validaciones!C273)","v":"Requisito manejo del Inglés"},{"$f":"+IF(Validaciones!D273=\"\",\"\",Validaciones!D273)","v":"VIRTUAL "},{"$f":"+IF(Validaciones!E273=\"\",\"\",Validaciones!E273)","v":"NACIONAL"},{"$f":"+IF(Validaciones!F273=\"\",\"\",Validaciones!F273)","v":"2019-04-02"},{"$f":"+IF(Validaciones!G273=\"\",\"\",Validaciones!G273)","v":"2:00 - 3:00 p.m."},{"$f":"+IF(Validaciones!H273=\"\",\"\",Validaciones!H273)","v":"LIBERTY MUTUAL"},{"$f":"+IF(Validaciones!I273=\"\",\"\",Validaciones!I273)","v":"(en blanco)"},null,{"$f":"+IF(Validaciones!I275=\"\",\"\",Validaciones!I275)","v":"(en blanco)"},{"$f":"IF(B279=\"\",\"\",+VLOOKUP(B279,'PRESENCIAL NACIONAL - VIRTUALES'!C:N,12,0))","v":0}]
[{"$f":"+IF(Validaciones!A274=\"\",\"\",Validaciones!A274)","v":"LIBERTY MUTUAL "},{"$f":"+IF(Validaciones!B274=\"\",\"\",Validaciones!B274)","v":"Controlling Distracted Driving"},{"$f":"+IF(Validaciones!C274=\"\",\"\",Validaciones!C274)","v":"Requisito manejo del Inglés"},{"$f":"+IF(Validaciones!D274=\"\",\"\",Validaciones!D274)","v":"VIRTUAL "},{"$f":"+IF(Validaciones!E274=\"\",\"\",Validaciones!E274)","v":"NACIONAL"},{"$f":"+IF(Validaciones!F274=\"\",\"\",Validaciones!F274)","v":"2019-05-11"},{"$f":"+IF(Validaciones!G274=\"\",\"\",Validaciones!G274)","v":"2:00 - 3:00 p.m."},{"$f":"+IF(Validaciones!H274=\"\",\"\",Validaciones!H274)","v":"LIBERTY MUTUAL"},{"$f":"+IF(Validaciones!I274=\"\",\"\",Validaciones!I274)","v":"(en blanco)"},null,{"$f":"+IF(Validaciones!I276=\"\",\"\",Validaciones!I276)","v":"(en blanco)"},{"$f":"IF(B280=\"\",\"\",+VLOOKUP(B280,'PRESENCIAL NACIONAL - VIRTUALES'!C:N,12,0))","v":0}]
[{"$f":"+IF(Validaciones!A275=\"\",\"\",Validaciones!A275)","v":"LIBERTY MUTUAL "},{"$f":"+IF(Validaciones!B275=\"\",\"\",Validaciones!B275)","v":"Prevention through Design"},{"$f":"+IF(Validaciones!C275=\"\",\"\",Validaciones!C275)","v":"Requisito manejo del Inglés"},{"$f":"+IF(Validaciones!D275=\"\",\"\",Validaciones!D275)","v":"VIRTUAL "},{"$f":"+IF(Validaciones!E275=\"\",\"\",Validaciones!E275)","v":"NACIONAL"},{"$f":"+IF(Validaciones!F275=\"\",\"\",Validaciones!F275)","v":"2019-05-08"},{"$f":"+IF(Validaciones!G275=\"\",\"\",Validaciones!G275)","v":"2:00 - 3:00 p.m."},{"$f":"+IF(Validaciones!H275=\"\",\"\",Validaciones!H275)","v":"LIBERTY MUTUAL"},{"$f":"+IF(Validaciones!I275=\"\",\"\",Validaciones!I275)","v":"(en blanco)"},null,{"$f":"+IF(Validaciones!I277=\"\",\"\",Validaciones!I277)","v":"(en blanco)"},{"$f":"IF(B281=\"\",\"\",+VLOOKUP(B281,'PRESENCIAL NACIONAL - VIRTUALES'!C:N,12,0))","v":0}]
[{"$f":"+IF(Validaciones!A276=\"\",\"\",Validaciones!A276)","v":"LIBERTY MUTUAL "},{"$f":"+IF(Validaciones!B276=\"\",\"\",Validaciones!B276)","v":"Prevention through Design (PtD)"},{"$f":"+IF(Validaciones!C276=\"\",\"\",Validaciones!C276)","v":"Requisito manejo del Inglés"},{"$f":"+IF(Validaciones!D276=\"\",\"\",Validaciones!D276)","v":"VIRTUAL "},{"$f":"+IF(Validaciones!E276=\"\",\"\",Validaciones!E276)","v":"NACIONAL"},{"$f":"+IF(Validaciones!F276=\"\",\"\",Validaciones!F276)","v":"2019-05-08"},{"$f":"+IF(Validaciones!G276=\"\",\"\",Validaciones!G276)","v":"2:00 - 3:00 p.m."},{"$f":"+IF(Validaciones!H276=\"\",\"\",Validaciones!H276)","v":"LIBERTY MUTUAL"},{"$f":"+IF(Validaciones!I276=\"\",\"\",Validaciones!I276)","v":"(en blanco)"},null,{"$f":"+IF(Validaciones!I278=\"\",\"\",Validaciones!I278)","v":"(en blanco)"},{"$f":"IF(B282=\"\",\"\",+VLOOKUP(B282,'PRESENCIAL NACIONAL - VIRTUALES'!C:N,12,0))","v":0}]
[{"$f":"+IF(Validaciones!A277=\"\",\"\",Validaciones!A277)","v":"LIBERTY MUTUAL "},{"$f":"+IF(Validaciones!B277=\"\",\"\",Validaciones!B277)","v":"Opioids in the Workplace"},{"$f":"+IF(Validaciones!C277=\"\",\"\",Validaciones!C277)","v":"Requisito manejo del Inglés"},{"$f":"+IF(Validaciones!D277=\"\",\"\",Validaciones!D277)","v":"VIRTUAL "},{"$f":"+IF(Validaciones!E277=\"\",\"\",Validaciones!E277)","v":"NACIONAL"},{"$f":"+IF(Validaciones!F277=\"\",\"\",Validaciones!F277)","v":"2019-05-14"},{"$f":"+IF(Validaciones!G277=\"\",\"\",Validaciones!G277)","v":"2:00 - 3:00 p.m."},{"$f":"+IF(Validaciones!H277=\"\",\"\",Validaciones!H277)","v":"LIBERTY MUTUAL"},{"$f":"+IF(Validaciones!I277=\"\",\"\",Validaciones!I277)","v":"(en blanco)"},null,{"$f":"+IF(Validaciones!I279=\"\",\"\",Validaciones!I279)","v":"(en blanco)"},{"$f":"IF(B283=\"\",\"\",+VLOOKUP(B283,'PRESENCIAL NACIONAL - VIRTUALES'!C:N,12,0))","v":0}]
[{"$f":"+IF(Validaciones!A278=\"\",\"\",Validaciones!A278)","v":"LIBERTY MUTUAL "},{"$f":"+IF(Validaciones!B278=\"\",\"\",Validaciones!B278)","v":"Journey Management"},{"$f":"+IF(Validaciones!C278=\"\",\"\",Validaciones!C278)","v":"Requisito manejo del Inglés"},{"$f":"+IF(Validaciones!D278=\"\",\"\",Validaciones!D278)","v":"VIRTUAL "},{"$f":"+IF(Validaciones!E278=\"\",\"\",Validaciones!E278)","v":"NACIONAL"},{"$f":"+IF(Validaciones!F278=\"\",\"\",Validaciones!F278)","v":"2019-05-16"},{"$f":"+IF(Validaciones!G278=\"\",\"\",Validaciones!G278)","v":"2:00 - 3:00 p.m."},{"$f":"+IF(Validaciones!H278=\"\",\"\",Validaciones!H278)","v":"LIBERTY MUTUAL"},{"$f":"+IF(Validaciones!I278=\"\",\"\",Validaciones!I278)","v":"(en blanco)"},null,{"$f":"+IF(Validaciones!I280=\"\",\"\",Validaciones!I280)","v":"(en blanco)"},{"$f":"IF(B284=\"\",\"\",+VLOOKUP(B284,'PRESENCIAL NACIONAL - VIRTUALES'!C:N,12,0))","v":0}]
[{"$f":"+IF(Validaciones!A279=\"\",\"\",Validaciones!A279)","v":"LIBERTY MUTUAL "},{"$f":"+IF(Validaciones!B279=\"\",\"\",Validaciones!B279)","v":"Management Systems for Occupational Health & Safety"},{"$f":"+IF(Validaciones!C279=\"\",\"\",Validaciones!C279)","v":"Requisito manejo del Inglés"},{"$f":"+IF(Validaciones!D279=\"\",\"\",Validaciones!D279)","v":"VIRTUAL "},{"$f":"+IF(Validaciones!E279=\"\",\"\",Validaciones!E279)","v":"NACIONAL"},{"$f":"+IF(Validaciones!F279=\"\",\"\",Validaciones!F279)","v":"2019-05-23"},{"$f":"+IF(Validaciones!G279=\"\",\"\",Validaciones!G279)","v":"2:00 - 3:00 p.m."},{"$f":"+IF(Validaciones!H279=\"\",\"\",Validaciones!H279)","v":"LIBERTY MUTUAL"},{"$f":"+IF(Validaciones!I279=\"\",\"\",Validaciones!I279)","v":"(en blanco)"},null,{"$f":"+IF(Validaciones!I281=\"\",\"\",Validaciones!I281)","v":"(en blanco)"},{"$f":"IF(B285=\"\",\"\",+VLOOKUP(B285,'PRESENCIAL NACIONAL - VIRTUALES'!C:N,12,0))","v":0}]
[{"$f":"+IF(Validaciones!A280=\"\",\"\",Validaciones!A280)","v":"LIBERTY MUTUAL "},{"$f":"+IF(Validaciones!B280=\"\",\"\",Validaciones!B280)","v":"Slip, Trips and Falls Prevention"},{"$f":"+IF(Validaciones!C280=\"\",\"\",Validaciones!C280)","v":"Requisito manejo del Inglés"},{"$f":"+IF(Validaciones!D280=\"\",\"\",Validaciones!D280)","v":"VIRTUAL "},{"$f":"+IF(Validaciones!E280=\"\",\"\",Validaciones!E280)","v":"NACIONAL"},{"$f":"+IF(Validaciones!F280=\"\",\"\",Validaciones!F280)","v":"2019-06-04"},{"$f":"+IF(Validaciones!G280=\"\",\"\",Validaciones!G280)","v":"2:00 - 3:00 p.m."},{"$f":"+IF(Validaciones!H280=\"\",\"\",Validaciones!H280)","v":"LIBERTY MUTUAL"},{"$f":"+IF(Validaciones!I280=\"\",\"\",Validaciones!I280)","v":"(en blanco)"},null,{"$f":"+IF(Validaciones!I282=\"\",\"\",Validaciones!I282)","v":"(en blanco)"},{"$f":"IF(B286=\"\",\"\",+VLOOKUP(B286,'PRESENCIAL NACIONAL - VIRTUALES'!C:N,12,0))","v":0}]
[{"$f":"+IF(Validaciones!A281=\"\",\"\",Validaciones!A281)","v":"LIBERTY MUTUAL "},{"$f":"+IF(Validaciones!B281=\"\",\"\",Validaciones!B281)","v":"Business Continuity - Planning for the Unexpected"},{"$f":"+IF(Validaciones!C281=\"\",\"\",Validaciones!C281)","v":"Requisito manejo del Inglés"},{"$f":"+IF(Validaciones!D281=\"\",\"\",Validaciones!D281)","v":"VIRTUAL "},{"$f":"+IF(Validaciones!E281=\"\",\"\",Validaciones!E281)","v":"NACIONAL"},{"$f":"+IF(Validaciones!F281=\"\",\"\",Validaciones!F281)","v":"2019-06-05"},{"$f":"+IF(Validaciones!G281=\"\",\"\",Validaciones!G281)","v":"2:00 - 3:00 p.m."},{"$f":"+IF(Validaciones!H281=\"\",\"\",Validaciones!H281)","v":"LIBERTY MUTUAL"},{"$f":"+IF(Validaciones!I281=\"\",\"\",Validaciones!I281)","v":"(en blanco)"},null,{"$f":"+IF(Validaciones!I283=\"\",\"\",Validaciones!I283)","v":"(en blanco)"},{"$f":"IF(B287=\"\",\"\",+VLOOKUP(B287,'PRESENCIAL NACIONAL - VIRTUALES'!C:N,12,0))","v":0}]
[{"$f":"+IF(Validaciones!A282=\"\",\"\",Validaciones!A282)","v":"LIBERTY MUTUAL "},{"$f":"+IF(Validaciones!B282=\"\",\"\",Validaciones!B282)","v":"Safety Climate - The Pulse of Safety in Organizations"},{"$f":"+IF(Validaciones!C282=\"\",\"\",Validaciones!C282)","v":"Requisito manejo del Inglés"},{"$f":"+IF(Validaciones!D282=\"\",\"\",Validaciones!D282)","v":"VIRTUAL "},{"$f":"+IF(Validaciones!E282=\"\",\"\",Validaciones!E282)","v":"NACIONAL"},{"$f":"+IF(Validaciones!F282=\"\",\"\",Validaciones!F282)","v":"2019-05-11"},{"$f":"+IF(Validaciones!G282=\"\",\"\",Validaciones!G282)","v":"2:00 - 3:00 p.m."},{"$f":"+IF(Validaciones!H282=\"\",\"\",Validaciones!H282)","v":"LIBERTY MUTUAL"},{"$f":"+IF(Validaciones!I282=\"\",\"\",Validaciones!I282)","v":"(en blanco)"},null,{"$f":"+IF(Validaciones!I284=\"\",\"\",Validaciones!I284)","v":"(en blanco)"},{"$f":"IF(B288=\"\",\"\",+VLOOKUP(B288,'PRESENCIAL NACIONAL - VIRTUALES'!C:N,12,0))","v":0}]
[{"$f":"+IF(Validaciones!A283=\"\",\"\",Validaciones!A283)","v":"LIBERTY MUTUAL "},{"$f":"+IF(Validaciones!B283=\"\",\"\",Validaciones!B283)","v":"General Liability Incident Response"},{"$f":"+IF(Validaciones!C283=\"\",\"\",Validaciones!C283)","v":"Requisito manejo del Inglés"},{"$f":"+IF(Validaciones!D283=\"\",\"\",Validaciones!D283)","v":"VIRTUAL "},{"$f":"+IF(Validaciones!E283=\"\",\"\",Validaciones!E283)","v":"NACIONAL"},{"$f":"+IF(Validaciones!F283=\"\",\"\",Validaciones!F283)","v":"2019-09-19"},{"$f":"+IF(Validaciones!G283=\"\",\"\",Validaciones!G283)","v":"2:00 - 3:00 p.m."},{"$f":"+IF(Validaciones!H283=\"\",\"\",Validaciones!H283)","v":"LIBERTY MUTUAL"},{"$f":"+IF(Validaciones!I283=\"\",\"\",Validaciones!I283)","v":"(en blanco)"},null,{"$f":"+IF(Validaciones!I285=\"\",\"\",Validaciones!I285)","v":"(en blanco)"},{"$f":"IF(B289=\"\",\"\",+VLOOKUP(B289,'PRESENCIAL NACIONAL - VIRTUALES'!C:N,12,0))","v":0}]
[{"$f":"+IF(Validaciones!A284=\"\",\"\",Validaciones!A284)","v":"LIBERTY MUTUAL "},{"$f":"+IF(Validaciones!B284=\"\",\"\",Validaciones!B284)","v":"Getting Results: Coaching & Feedback for Supervisors"},{"$f":"+IF(Validaciones!C284=\"\",\"\",Validaciones!C284)","v":"Requisito manejo del Inglés"},{"$f":"+IF(Validaciones!D284=\"\",\"\",Validaciones!D284)","v":"VIRTUAL "},{"$f":"+IF(Validaciones!E284=\"\",\"\",Validaciones!E284)","v":"NACIONAL"},{"$f":"+IF(Validaciones!F284=\"\",\"\",Validaciones!F284)","v":"2019-10-10"},{"$f":"+IF(Validaciones!G284=\"\",\"\",Validaciones!G284)","v":"2:00 - 3:00 p.m."},{"$f":"+IF(Validaciones!H284=\"\",\"\",Validaciones!H284)","v":"LIBERTY MUTUAL"},{"$f":"+IF(Validaciones!I284=\"\",\"\",Validaciones!I284)","v":"(en blanco)"},null,{"$f":"+IF(Validaciones!I286=\"\",\"\",Validaciones!I286)","v":200},{"$f":"IF(B290=\"\",\"\",+VLOOKUP(B290,'PRESENCIAL NACIONAL - VIRTUALES'!C:N,12,0))","v":0}]
[{"$f":"+IF(Validaciones!A285=\"\",\"\",Validaciones!A285)","v":"LIBERTY MUTUAL "},{"$f":"+IF(Validaciones!B285=\"\",\"\",Validaciones!B285)","v":"Active Shooter/Workplace Violence - Managing the Crisis"},{"$f":"+IF(Validaciones!C285=\"\",\"\",Validaciones!C285)","v":"Requisito manejo del Inglés"},{"$f":"+IF(Validaciones!D285=\"\",\"\",Validaciones!D285)","v":"VIRTUAL "},{"$f":"+IF(Validaciones!E285=\"\",\"\",Validaciones!E285)","v":"NACIONAL"},{"$f":"+IF(Validaciones!F285=\"\",\"\",Validaciones!F285)","v":"2019-10-23"},{"$f":"+IF(Validaciones!G285=\"\",\"\",Validaciones!G285)","v":"2:00 - 3:00 p.m."},{"$f":"+IF(Validaciones!H285=\"\",\"\",Validaciones!H285)","v":"LIBERTY MUTUAL"},{"$f":"+IF(Validaciones!I285=\"\",\"\",Validaciones!I285)","v":"(en blanco)"},null,{"$f":"+IF(Validaciones!I287=\"\",\"\",Validaciones!I287)","v":200},{"$f":"IF(B291=\"\",\"\",+VLOOKUP(B291,'PRESENCIAL NACIONAL - VIRTUALES'!C:N,12,0))","v":0}]
[{"$f":"+IF(Validaciones!A286=\"\",\"\",Validaciones!A286)","v":"MANEJO SEGURO DE ESCALERAS"},{"$f":"+IF(Validaciones!B286=\"\",\"\",Validaciones!B286)","v":"Curso sobre manejo seguro de escaleras "},{"$f":"+IF(Validaciones!C286=\"\",\"\",Validaciones!C286)","v":"Responsable del sistema de gestión, supervisores y trabajares."},{"$f":"+IF(Validaciones!D286=\"\",\"\",Validaciones!D286)","v":"VIRTUAL "},{"$f":"+IF(Validaciones!E286=\"\",\"\",Validaciones!E286)","v":"NACIONAL"},{"$f":"+IF(Validaciones!F286=\"\",\"\",Validaciones!F286)","v":"2019-04-10"},{"$f":"+IF(Validaciones!G286=\"\",\"\",Validaciones!G286)","v":"2:00 - 4:00 p.m."},{"$f":"+IF(Validaciones!H286=\"\",\"\",Validaciones!H286)","v":"Liberty University"},{"$f":"+IF(Validaciones!I286=\"\",\"\",Validaciones!I286)","v":200},null,{"$f":"+IF(Validaciones!I288=\"\",\"\",Validaciones!I288)","v":200},{"$f":"IF(B292=\"\",\"\",+VLOOKUP(B292,'PRESENCIAL NACIONAL - VIRTUALES'!C:N,12,0))","v":0}]
[{"$f":"+IF(Validaciones!A287=\"\",\"\",Validaciones!A287)","v":"ACOSO LABORAL "},{"$f":"+IF(Validaciones!B287=\"\",\"\",Validaciones!B287)","v":"Acoso Laboral (Aula viviendo en armonía)."},{"$f":"+IF(Validaciones!C287=\"\",\"\",Validaciones!C287)","v":"Trabajadores afiliados a Liberty"},{"$f":"+IF(Validaciones!D287=\"\",\"\",Validaciones!D287)","v":"VIRTUAL "},{"$f":"+IF(Validaciones!E287=\"\",\"\",Validaciones!E287)","v":"NACIONAL"},{"$f":"+IF(Validaciones!F287=\"\",\"\",Validaciones!F287)","v":"2019-10-31"},{"$f":"+IF(Validaciones!G287=\"\",\"\",Validaciones!G287)","v":"Abierto"},{"$f":"+IF(Validaciones!H287=\"\",\"\",Validaciones!H287)","v":"Liberty University"},{"$f":"+IF(Validaciones!I287=\"\",\"\",Validaciones!I287)","v":200},null,{"$f":"+IF(Validaciones!I289=\"\",\"\",Validaciones!I289)","v":200},{"$f":"IF(B293=\"\",\"\",+VLOOKUP(B293,'PRESENCIAL NACIONAL - VIRTUALES'!C:N,12,0))","v":0}]
[{"$f":"+IF(Validaciones!A288=\"\",\"\",Validaciones!A288)","v":"GESTION DEL RIESGO BAJO LA 31000 "},{"$f":"+IF(Validaciones!B288=\"\",\"\",Validaciones!B288)","v":"Propósito de la norma ISO 31000. "},{"$f":"+IF(Validaciones!C288=\"\",\"\",Validaciones!C288)","v":"Los participantes deben estar afiliados a la ARL LIBERTY."},{"$f":"+IF(Validaciones!D288=\"\",\"\",Validaciones!D288)","v":"VIRTUAL "},{"$f":"+IF(Validaciones!E288=\"\",\"\",Validaciones!E288)","v":"NACIONAL"},{"$f":"+IF(Validaciones!F288=\"\",\"\",Validaciones!F288)","v":"2019-05-27"},{"$f":"+IF(Validaciones!G288=\"\",\"\",Validaciones!G288)","v":"10:00 a.m. a 12:00 m"},{"$f":"+IF(Validaciones!H288=\"\",\"\",Validaciones!H288)","v":"Liberty University"},{"$f":"+IF(Validaciones!I288=\"\",\"\",Validaciones!I288)","v":200},null,{"$f":"+IF(Validaciones!I290=\"\",\"\",Validaciones!I290)","v":200},{"$f":"IF(B294=\"\",\"\",+VLOOKUP(B294,'PRESENCIAL NACIONAL - VIRTUALES'!C:N,12,0))","v":0}]
[{"$f":"+IF(Validaciones!A289=\"\",\"\",Validaciones!A289)","v":"TAREAS DE ALTO RIESGO (Curso Administración de tareas de alto riesgo)"},{"$f":"+IF(Validaciones!B289=\"\",\"\",Validaciones!B289)","v":"1. Administración de tareas de alto riesgo.\n2. Espacios confinados\n3. Trabajo en alturas\n4. Energías peligrosas\n5. Izaje de cargas\n6. Exposición a riesgo químico\n7. Trabajos en caliente\n8. Trabajo seguro en excavaciones\n"},{"$f":"+IF(Validaciones!C289=\"\",\"\",Validaciones!C289)","v":"Los participantes deben estar afiliados a ARL Liberty y tener a cargo el SG-SST. Personal con exposición a peligro por condición de seguridad, trabajo en alturas."},{"$f":"+IF(Validaciones!D289=\"\",\"\",Validaciones!D289)","v":"VIRTUAL "},{"$f":"+IF(Validaciones!E289=\"\",\"\",Validaciones!E289)","v":"NACIONAL"},{"$f":"+IF(Validaciones!F289=\"\",\"\",Validaciones!F289)","v":"2019-10-31"},{"$f":"+IF(Validaciones!G289=\"\",\"\",Validaciones!G289)","v":"Abierto "},{"$f":"+IF(Validaciones!H289=\"\",\"\",Validaciones!H289)","v":"Liberty University"},{"$f":"+IF(Validaciones!I289=\"\",\"\",Validaciones!I289)","v":200},null,{"$f":"+IF(Validaciones!I291=\"\",\"\",Validaciones!I291)","v":"(en blanco)"},{"$f":"IF(B295=\"\",\"\",+VLOOKUP(B295,'PRESENCIAL NACIONAL - VIRTUALES'!C:N,12,0))","v":0}]
[{"$f":"+IF(Validaciones!A290=\"\",\"\",Validaciones!A290)","v":"PREVENCIÓN DE CONSUMO DE SUSTANCIAS PSICOACTIVAS. SIN ADICCIÓN ME QUIERO MÁS. "},{"$f":"+IF(Validaciones!B290=\"\",\"\",Validaciones!B290)","v":"Capacitación sobre herramientas de  prevención  en el consumo de alcohol y sustancias psicoactivas en el ámbito laboral.  Programa Sin adicción me quiero más de ARL Liberty. "},{"$f":"+IF(Validaciones!C290=\"\",\"\",Validaciones!C290)","v":"Los participantes deben estar afiliados a la ARL LIBERTY  y  tener a cargo el Sistema de Gestión de Seguridad y Salud en el Trabajo o pertenecer al área de Recursos Humanos"},{"$f":"+IF(Validaciones!D290=\"\",\"\",Validaciones!D290)","v":"VIRTUAL "},{"$f":"+IF(Validaciones!E290=\"\",\"\",Validaciones!E290)","v":"NACIONAL"},{"$f":"+IF(Validaciones!F290=\"\",\"\",Validaciones!F290)","v":"2019-10-31"},{"$f":"+IF(Validaciones!G290=\"\",\"\",Validaciones!G290)","v":"Abierto "},{"$f":"+IF(Validaciones!H290=\"\",\"\",Validaciones!H290)","v":"Liberty University"},{"$f":"+IF(Validaciones!I290=\"\",\"\",Validaciones!I290)","v":200},null,{"$f":"+IF(Validaciones!I292=\"\",\"\",Validaciones!I292)","v":200},{"$f":"IF(B296=\"\",\"\",+VLOOKUP(B296,'PRESENCIAL NACIONAL - VIRTUALES'!C:N,12,0))","v":0}]
[{"$f":"+IF(Validaciones!A291=\"\",\"\",Validaciones!A291)","v":"RECLASIFICACIÓN DE RIESGOS "},{"$f":"+IF(Validaciones!B291=\"\",\"\",Validaciones!B291)","v":"Explica el concepto y proceso de reclasificación; cuándo es procendente realizarlo y cuándo no.  "},{"$f":"+IF(Validaciones!C291=\"\",\"\",Validaciones!C291)","v":"Dirigido para encargados del Sistema de Gestión de Seguridad y Salud en el Trabajo y personal del área de Talento Humano. "},{"$f":"+IF(Validaciones!D291=\"\",\"\",Validaciones!D291)","v":"VIRTUAL "},{"$f":"+IF(Validaciones!E291=\"\",\"\",Validaciones!E291)","v":"NACIONAL"},{"$f":"+IF(Validaciones!F291=\"\",\"\",Validaciones!F291)","v":"2019-10-31"},{"$f":"+IF(Validaciones!G291=\"\",\"\",Validaciones!G291)","v":"Abierto"},{"$f":"+IF(Validaciones!H291=\"\",\"\",Validaciones!H291)","v":"Liberty University"},{"$f":"+IF(Validaciones!I291=\"\",\"\",Validaciones!I291)","v":"(en blanco)"},null,{"$f":"+IF(Validaciones!I293=\"\",\"\",Validaciones!I293)","v":""},{"$f":"IF(B297=\"\",\"\",+VLOOKUP(B297,'PRESENCIAL NACIONAL - VIRTUALES'!C:N,12,0))","v":0}]
[{"$f":"+IF(Validaciones!A292=\"\",\"\",Validaciones!A292)","v":"GESTIÓN EFECTIVA DEL COMITÉ PARITARIO DE SALUD OCUPACIONAL COPASST"},{"$f":"+IF(Validaciones!B292=\"\",\"\",Validaciones!B292)","v":"Capacitación copasst   (Inspecciones de seguridad, Investigación accidentes de trabajo, Elementos de Protección Personal, Hábitos saludables, primeros auxilios, Liderazo). Conozca más sobre la Herramienta de Excel CIL copasst Interactivo. "},{"$f":"+IF(Validaciones!C292=\"\",\"\",Validaciones!C292)","v":"Dirigida a los Comités Paritarios de Salud Ocupacional. "},{"$f":"+IF(Validaciones!D292=\"\",\"\",Validaciones!D292)","v":"VIRTUAL "},{"$f":"+IF(Validaciones!E292=\"\",\"\",Validaciones!E292)","v":"NACIONAL"},{"$f":"+IF(Validaciones!F292=\"\",\"\",Validaciones!F292)","v":"2019-10-31"},{"$f":"+IF(Validaciones!G292=\"\",\"\",Validaciones!G292)","v":"Abierto "},{"$f":"+IF(Validaciones!H292=\"\",\"\",Validaciones!H292)","v":"Liberty University"},{"$f":"+IF(Validaciones!I292=\"\",\"\",Validaciones!I292)","v":200},null,{"$f":"+IF(Validaciones!I294=\"\",\"\",Validaciones!I294)","v":""},{"$f":"IF(B298=\"\",\"\",+VLOOKUP(B298,'PRESENCIAL NACIONAL - VIRTUALES'!C:N,12,0))","v":0}]
[{"$f":"+IF(Validaciones!A293=\"\",\"\",Validaciones!A293)","v":""},{"$f":"+IF(Validaciones!B293=\"\",\"\",Validaciones!B293)","v":""},{"$f":"+IF(Validaciones!C293=\"\",\"\",Validaciones!C293)","v":""},{"$f":"+IF(Validaciones!D293=\"\",\"\",Validaciones!D293)","v":""},{"$f":"+IF(Validaciones!E293=\"\",\"\",Validaciones!E293)","v":""},{"$f":"+IF(Validaciones!F293=\"\",\"\",Validaciones!F293)","v":""},{"$f":"+IF(Validaciones!G293=\"\",\"\",Validaciones!G293)","v":""},{"$f":"+IF(Validaciones!H293=\"\",\"\",Validaciones!H293)","v":""},{"$f":"+IF(Validaciones!I293=\"\",\"\",Validaciones!I293)","v":""},null,{"$f":"+IF(Validaciones!I295=\"\",\"\",Validaciones!I295)","v":""},{"$f":"IF(B299=\"\",\"\",+VLOOKUP(B299,'PRESENCIAL NACIONAL - VIRTUALES'!C:N,12,0))","v":""}]
[{"$f":"+IF(Validaciones!A294=\"\",\"\",Validaciones!A294)","v":""},{"$f":"+IF(Validaciones!B294=\"\",\"\",Validaciones!B294)","v":""},{"$f":"+IF(Validaciones!C294=\"\",\"\",Validaciones!C294)","v":""},{"$f":"+IF(Validaciones!D294=\"\",\"\",Validaciones!D294)","v":""},{"$f":"+IF(Validaciones!E294=\"\",\"\",Validaciones!E294)","v":""},{"$f":"+IF(Validaciones!F294=\"\",\"\",Validaciones!F294)","v":""},{"$f":"+IF(Validaciones!G294=\"\",\"\",Validaciones!G294)","v":""},{"$f":"+IF(Validaciones!H294=\"\",\"\",Validaciones!H294)","v":""},{"$f":"+IF(Validaciones!I294=\"\",\"\",Validaciones!I294)","v":""},null,{"$f":"+IF(Validaciones!I296=\"\",\"\",Validaciones!I296)","v":""},{"$f":"IF(B300=\"\",\"\",+VLOOKUP(B300,'PRESENCIAL NACIONAL - VIRTUALES'!C:N,12,0))","v":""}]
[{"$f":"+IF(Validaciones!A295=\"\",\"\",Validaciones!A295)","v":""},{"$f":"+IF(Validaciones!B295=\"\",\"\",Validaciones!B295)","v":""},{"$f":"+IF(Validaciones!C295=\"\",\"\",Validaciones!C295)","v":""},{"$f":"+IF(Validaciones!D295=\"\",\"\",Validaciones!D295)","v":""},{"$f":"+IF(Validaciones!E295=\"\",\"\",Validaciones!E295)","v":""},{"$f":"+IF(Validaciones!F295=\"\",\"\",Validaciones!F295)","v":""},{"$f":"+IF(Validaciones!G295=\"\",\"\",Validaciones!G295)","v":""},{"$f":"+IF(Validaciones!H295=\"\",\"\",Validaciones!H295)","v":""},{"$f":"+IF(Validaciones!I295=\"\",\"\",Validaciones!I295)","v":""},null,{"$f":"+IF(Validaciones!I297=\"\",\"\",Validaciones!I297)","v":""},{"$f":"IF(B301=\"\",\"\",+VLOOKUP(B301,'PRESENCIAL NACIONAL - VIRTUALES'!C:N,12,0))","v":""}]
[{"$f":"+IF(Validaciones!A296=\"\",\"\",Validaciones!A296)","v":""},{"$f":"+IF(Validaciones!B296=\"\",\"\",Validaciones!B296)","v":""},{"$f":"+IF(Validaciones!C296=\"\",\"\",Validaciones!C296)","v":""},{"$f":"+IF(Validaciones!D296=\"\",\"\",Validaciones!D296)","v":""},{"$f":"+IF(Validaciones!E296=\"\",\"\",Validaciones!E296)","v":""},{"$f":"+IF(Validaciones!F296=\"\",\"\",Validaciones!F296)","v":""},{"$f":"+IF(Validaciones!G296=\"\",\"\",Validaciones!G296)","v":""},{"$f":"+IF(Validaciones!H296=\"\",\"\",Validaciones!H296)","v":""},{"$f":"+IF(Validaciones!I296=\"\",\"\",Validaciones!I296)","v":""},null,{"$f":"+IF(Validaciones!I298=\"\",\"\",Validaciones!I298)","v":""},{"$f":"IF(B302=\"\",\"\",+VLOOKUP(B302,'PRESENCIAL NACIONAL - VIRTUALES'!C:N,12,0))","v":""}]
[{"$f":"+IF(Validaciones!A297=\"\",\"\",Validaciones!A297)","v":""},{"$f":"+IF(Validaciones!B297=\"\",\"\",Validaciones!B297)","v":""},{"$f":"+IF(Validaciones!C297=\"\",\"\",Validaciones!C297)","v":""},{"$f":"+IF(Validaciones!D297=\"\",\"\",Validaciones!D297)","v":""},{"$f":"+IF(Validaciones!E297=\"\",\"\",Validaciones!E297)","v":""},{"$f":"+IF(Validaciones!F297=\"\",\"\",Validaciones!F297)","v":""},{"$f":"+IF(Validaciones!G297=\"\",\"\",Validaciones!G297)","v":""},{"$f":"+IF(Validaciones!H297=\"\",\"\",Validaciones!H297)","v":""},{"$f":"+IF(Validaciones!I297=\"\",\"\",Validaciones!I297)","v":""},null,{"$f":"+IF(Validaciones!I299=\"\",\"\",Validaciones!I299)","v":""},{"$f":"IF(B303=\"\",\"\",+VLOOKUP(B303,'PRESENCIAL NACIONAL - VIRTUALES'!C:N,12,0))","v":""}]
[{"$f":"+IF(Validaciones!A298=\"\",\"\",Validaciones!A298)","v":""},{"$f":"+IF(Validaciones!B298=\"\",\"\",Validaciones!B298)","v":""},{"$f":"+IF(Validaciones!C298=\"\",\"\",Validaciones!C298)","v":""},{"$f":"+IF(Validaciones!D298=\"\",\"\",Validaciones!D298)","v":""},{"$f":"+IF(Validaciones!E298=\"\",\"\",Validaciones!E298)","v":""},{"$f":"+IF(Validaciones!F298=\"\",\"\",Validaciones!F298)","v":""},{"$f":"+IF(Validaciones!G298=\"\",\"\",Validaciones!G298)","v":""},{"$f":"+IF(Validaciones!H298=\"\",\"\",Validaciones!H298)","v":""},{"$f":"+IF(Validaciones!I298=\"\",\"\",Validaciones!I298)","v":""},null,{"$f":"+IF(Validaciones!I300=\"\",\"\",Validaciones!I300)","v":""},{"$f":"IF(B304=\"\",\"\",+VLOOKUP(B304,'PRESENCIAL NACIONAL - VIRTUALES'!C:N,12,0))","v":""}]
[{"$f":"+IF(Validaciones!A299=\"\",\"\",Validaciones!A299)","v":""},{"$f":"+IF(Validaciones!B299=\"\",\"\",Validaciones!B299)","v":""},{"$f":"+IF(Validaciones!C299=\"\",\"\",Validaciones!C299)","v":""},{"$f":"+IF(Validaciones!D299=\"\",\"\",Validaciones!D299)","v":""},{"$f":"+IF(Validaciones!E299=\"\",\"\",Validaciones!E299)","v":""},{"$f":"+IF(Validaciones!F299=\"\",\"\",Validaciones!F299)","v":""},{"$f":"+IF(Validaciones!G299=\"\",\"\",Validaciones!G299)","v":""},{"$f":"+IF(Validaciones!H299=\"\",\"\",Validaciones!H299)","v":""},{"$f":"+IF(Validaciones!I299=\"\",\"\",Validaciones!I299)","v":""},null,{"$f":"+IF(Validaciones!I301=\"\",\"\",Validaciones!I301)","v":""},{"$f":"IF(B305=\"\",\"\",+VLOOKUP(B305,'PRESENCIAL NACIONAL - VIRTUALES'!C:N,12,0))","v":""}]
[{"$f":"+IF(Validaciones!A300=\"\",\"\",Validaciones!A300)","v":""},{"$f":"+IF(Validaciones!B300=\"\",\"\",Validaciones!B300)","v":""},{"$f":"+IF(Validaciones!C300=\"\",\"\",Validaciones!C300)","v":""},{"$f":"+IF(Validaciones!D300=\"\",\"\",Validaciones!D300)","v":""},{"$f":"+IF(Validaciones!E300=\"\",\"\",Validaciones!E300)","v":""},{"$f":"+IF(Validaciones!F300=\"\",\"\",Validaciones!F300)","v":""},{"$f":"+IF(Validaciones!G300=\"\",\"\",Validaciones!G300)","v":""},{"$f":"+IF(Validaciones!H300=\"\",\"\",Validaciones!H300)","v":""},{"$f":"+IF(Validaciones!I300=\"\",\"\",Validaciones!I300)","v":""},null,{"$f":"+IF(Validaciones!I302=\"\",\"\",Validaciones!I302)","v":""},{"$f":"IF(B306=\"\",\"\",+VLOOKUP(B306,'PRESENCIAL NACIONAL - VIRTUALES'!C:N,12,0))","v":""}]

{"sheet":"INFORMACION INSCRIPCIONES","index":2,"n_rows":8,"n_cols":14,"rows_kept":8,"cut":false,"hidden":true,"merged":[[8,1,8,17],[0,1,0,17],[1,1,1,17],[2,1,2,17],[3,1,3,17],[4,1,4,9],[4,10,4,12],[4,13,4,17],[5,1,5,9],[5,10,5,12],[5,13,5,17],[6,1,6,17],[7,1,7,17]]}
[null,"POLITICAS DE INSCRIPCION PNE 2018"]
[null,"Para poder realizar su inscripción, la empresa afiliada debe tener en cuenta las siguientes políticas, las cuales serán de estricto cumplimiento\n\n1. La empresa debe estar afiliada en la ARL LIBERTY \n2. EL participante debe estar laborando como empleado directo en la empresa afiliada a la ARL LIBERTY \n3. Conocer la programación de interés en su ciudad antes de enviar su inscripción \n4. Seleccionar al funcionario que sea parte del equipo líder del SGSST o integrante del COPASST, Comité de convivencia o Brigada de emergencias o Recursos Humanos  para que sea multiplicador de la información al interior de la empresa.\n5. Para los entrenamientos en la Metodología presencial solo se permitirá la inscripción de dos (2) participantes por empresa, esto con el fin de brindar mayor cobertura a todas nuestras empresas afiliadas.  Los cupos en esta modalidad son limitados y estan sujetos a disponibilidad.                                              \n6. Realizar y enviar su pre-inscripción únicamente en el formato de inscripción establecido, al correo electrónico indicado. \n7. Enviar la inscripción a más tardar 8 días antes del curso, abstenerse de enviar programaciones de meses siguientes.                                                                                                                                                                                                                                                                                                     \n8. Para asistir a las capacitaciones, la empresa recibirá un correo electrónico de confirmación del cupo, el cual contiene la información necesaria para que el participante pueda asistir.                                                                                                                                                                               9. En caso de realizar el cambio de un participante confirmado, la empresa deberá informar el nombre del nuevo participante máximo con 3 días hábiles de anticipación a la capacitación.                                                                                                                                                                  10. Las confirmaciones se remiten 1 día antes del inicio del curso presencial                                                                                                                                                                                                                                                                                                                                                                                                                                                      11. La confirmación de los cursos virtuales se realizan 2 días antes, recibirá un correo de soporte aulas con las indicaciones para la conexión.                                                                                                                                                                                                                                                                                                                       12. Los cursos virtuales, excepto, el de Cruz Roja Colombiana, estarán abiertos todo el tiempo a partir de la fecha que allí se indica y podrán inscribirse en cualquier momento. "]
[null,"PROCESO DE INSCRIPCION AL PNE 2018"]
[null,"Después de definir a qué programa desea asistir, debe guardar el archivo en su equipo y  enviar el formato de inscripción totalmente diligenciado al correo"]
[null,"CORREO",null,null,null,null,null,null,null,null,"TELEFONO",null,null,"NOMBRE"]
[null,"inscripcionesPNE@Libertycolombia.com",null,null,null,null,null,null,null,null,"TEL: (1)3103300 EXT 1159",null,null,"Angélica Mora Hernández"]
[null," FORMATO UNICO PARA FORMALIZACIÓN DE INSCRIPCIÓN PNE 2018 "]
[null,"CONFIRMACIÓN DE CUPOS"]

{"sheet":"Validaciones","index":3,"n_rows":292,"n_cols":10,"rows_kept":292,"cut":false,"hidden":true,"merged":[]}
[]
[]
["Cuenta de TEMA"]
["PROGRAMA","TEMA","PERFIL DE LOS ASISTENTES","MODALIDAD ","CIUDAD","FECHA","HORARIO","LUGAR","PROMEDIO ASISTENTES POR EMPRESA","Total"]
["ATENCION DE LA ENFERMEDAD LABORAL","Proceso de definición de enfermedad laboral y calificación, acciones para prevenir los daños en caso de IPP e invalidez, para lograr la rehabilitación integral, procesos de readaptación y reubicación laboral","Los participantes deben estar afiliados a la ARL LIBERTY  y  tener a cargo el Sistema de Gestión de Seguridad y Salud en el Trabajo o pertenecer al área de Recursos Humanos o área médica de la empresa.","VIRTUAL ","NACIONAL","2019-03-01","9:00 a 11:00 a.m. ","Liberty University",200,1]
["ATENCION DEL ACCIDENTE LABORAL ","Acceso al servicio Asistencial y Reconocimiento de las prestaciones económicas de las contingencias de los accidentes laborales AL y enfermedad laboral EL.\n","Los participantes deben estar afiliados a la ARL LIBERTY  y  tener a cargo el Sistema de Gestión de Seguridad y Salud en el Trabajo o pertenecer al área de Recursos Humanos o área médica de la empresa.","VIRTUAL ","NACIONAL","2019-03-01","9:00 - 11:00 a.m.","Liberty University",200,1]
["COMITÉ DE CONVIVENCIA","COMITÉ DE CONVIVENCIA LABORAL (Aula viviendo en armonía).","Personal responsable del sistema de gestión, Talento humano y comité de convivencia. ","VIRTUAL ","NACIONAL","2019-10-31","Abierto","Liberty University",200,1]
["COPASST","Gestión Efectiva del Copasst. Módulo 1. Funciones y responsabilidades frente a dec. 1072 ,Reuniones efectivas, plan de trabajo,  Inspecciones de seguridad  y  auditoria.  ","Dirigidos a los copasst y vigias de seguridad y salud en el trabajo. ","PRESENCIAL ","BARRANQUILLA","2019-05-23","8:00 a.m. - 12:00 m","ICONTEC Cra 57 No. 70-89 Barranquilla",3,1]
["COPASST","Gestión Efectiva del Copasst. Módulo 1. Funciones y responsabilidades frente a dec. 1072 ,Reuniones efectivas, plan de trabajo,  Inspecciones de seguridad  y  auditoria.  ","Dirigidos a los copasst y vigias de seguridad y salud en el trabajo. ","PRESENCIAL ","BUCARAMANGA","2019-03-21","8:00 a.m. - 12:00 m","CAJASAN Cra 27 No 61-78",2,1]
["COPASST","Gestión Efectiva del Copasst. Módulo 1. Funciones y responsabilidades frente a dec. 1072 ,Reuniones efectivas, plan de trabajo,  Inspecciones de seguridad  y  auditoria.  ","Dirigidos a los copasst y vigias de seguridad y salud en el trabajo. ","PRESENCIAL ","CALI","2019-03-07","8:00 a.m. - 12:00 m","Av. 5 Norte # 38N-81",2,1]
["COPASST","Gestión Efectiva del Copasst. Módulo 1. Funciones y responsabilidades frente a dec. 1072 ,Reuniones efectivas, plan de trabajo,  Inspecciones de seguridad  y  auditoria.  ","Dirigidos a los copasst y vigias de seguridad y salud en el trabajo. ","PRESENCIAL ","CARTAGENA","2019-03-21","8:00 a.m. - 12:00 m","Liberty Seguros, Calle del Arsenal No 8B-195 piso 1",3,1]
["COPASST","Gestión Efectiva del Copasst. Módulo 1. Funciones y responsabilidades frente a dec. 1072 ,Reuniones efectivas, plan de trabajo,  Inspecciones de seguridad  y  auditoria.  ","Dirigidos a los copasst y vigias de seguridad y salud en el trabajo. ","PRESENCIAL ","BOGOTÁ","2019-03-21","8:00 a.m. - 12:00 m","Calle 73 N° 10 - 83 Torre C Oficina 302. Salón 302 Fucsia",2,1]
["COPASST","Gestión Efectiva del Copasst. Módulo 1. Funciones y responsabilidades frente a dec. 1072 ,Reuniones efectivas, plan de trabajo,  Inspecciones de seguridad  y  auditoria.  ","Dirigidos a los copasst y vigias de seguridad y salud en el trabajo. ","PRESENCIAL ","BOGOTÁ","2019-08-29","8:00 a.m. - 12:00 m","Calle 73 N° 10 - 83 Torre C Oficina 302. Salón 302 Fucsia",2,1]
["COPASST","Gestión Efectiva del Copasst. Módulo 1. Funciones y responsabilidades frente a dec. 1072 ,Reuniones efectivas, plan de trabajo,  Inspecciones de seguridad  y  auditoria.  ","Dirigidos a los copasst y vigias de seguridad y salud en el trabajo. ","PRESENCIAL ","MEDELLÍN ","2019-02-21","8:00 a.m. - 12:00 m","Carrera 43A No 19-17, auditorio piso 4 torre norte Block Empresarial",4,1]
["COPASST","Gestión Efectiva del Copasst. Módulo 2:  Investigación accidentes de trabajo ","Dirigidos a los copasst y vigias de seguridad y salud en el trabajo. ","PRESENCIAL ","BARRANQUILLA","2019-06-06","8:00 a.m. - 12:00 m","ICONTEC Cra 57 No. 70-89 Barranquilla",3,1]
["COPASST","Gestión Efectiva del Copasst. Módulo 2:  Investigación accidentes de trabajo ","Dirigidos a los copasst y vigias de seguridad y salud en el trabajo. ","PRESENCIAL ","BUCARAMANGA","2019-04-04","8:00 a.m. - 12:00 m","Hotel La Triada Cra. 20 #34--22",2,1]
["COPASST","Gestión Efectiva del Copasst. Módulo 2:  Investigación accidentes de trabajo ","Dirigidos a los copasst y vigias de seguridad y salud en el trabajo. ","PRESENCIAL ","CALI","2019-04-04","8:00 a.m. - 12:00 m","Av. 5 Norte # 38N-81",2,1]
["COPASST","Gestión Efectiva del Copasst. Módulo 2:  Investigación accidentes de trabajo ","Dirigidos a los copasst y vigias de seguridad y salud en el trabajo. ","PRESENCIAL ","CARTAGENA","2019-04-04","8:00 a.m. - 12:00 m","Liberty Seguros, Calle del Arsenal No 8B-195 piso 1",3,1]
["COPASST","Gestión Efectiva del Copasst. Módulo 2:  Investigación accidentes de trabajo ","Dirigidos a los copasst y vigias de seguridad y salud en el trabajo. ","PRESENCIAL ","BOGOTÁ","2019-09-19","8:00 a.m. - 12:00 m","Calle 73 N° 10 - 83 Torre C Oficina 302. Salón 302 Fucsia",2,1]
["COPASST","Gestión Efectiva del Copasst. Módulo 2:  Investigación accidentes de trabajo ","Dirigidos a los copasst y vigias de seguridad y salud en el trabajo. ","PRESENCIAL ","BOGOTÁ","2019-04-04","8:00 a.m. - 12:00 m","Calle 73 N° 10 - 83 Torre C Oficina 302. Salón 302 Fucsia",2,1]
["COPASST","Gestión Efectiva del Copasst. Módulo 2:  Investigación accidentes de trabajo ","Dirigidos a los copasst y vigias de seguridad y salud en el trabajo. ","PRESENCIAL ","MEDELLÍN ","2019-11-20","8:00 a.m. - 12:00 m","Carrera 43A No 19-17, auditorio piso 4 torre norte Block Empresarial",4,1]
["EMERGENCIAS","BRIGADAS DE EMERGENCIAS (Primeros Auxilios, Control de incendios y Evacuación)","Brigadistas","VIRTUAL ","NACIONAL","2019-08-05","Abierto a partir de agosto","curso virtual cruz roja colombiana ",2,1]
["EMERGENCIAS","BRIGADAS DE EMERGENCIAS (Primeros Auxilios, Control de incendios y Evacuación)","Brigadistas","VIRTUAL ","NACIONAL","2019-03-11","Abierto ","curso virtual cruz roja colombiana ",2,1]
["EMERGENCIAS","Entrenamiento práctico de emergencias  ","Brigadista con formación teórica ","PRESENCIAL ","BARRANCABERMEJA","2019-10-25","8:00am  - 5:00pm","Pendiente por definir",2,1]
["EMERGENCIAS","Entrenamiento práctico de emergencias  ","Brigadista con formación teórica ","PRESENCIAL ","BARRANQUILLA","2019-10-03","8:00 am - 5:00 pm","Previo a la actividad se estará confirmando lugar del evento ",3,1]
["EMERGENCIAS","Entrenamiento práctico de emergencias  ","Brigadista con formación teórica ","PRESENCIAL ","BUCARAMANGA","2019-10-25","8:00 am - 5:00 pm","CAJASAN Campo Alegre Vía Bucaramanga - Piedecuesta",2,1]
["EMERGENCIAS","Entrenamiento práctico de emergencias  ","Brigadista con formación teórica ","PRESENCIAL ","CALI","2019-07-26","8:00 am - 5:00 pm","CRA. 2 NRO. 4 - 29   YUMBO",2,1]
["EMERGENCIAS","Entrenamiento práctico de emergencias  ","Brigadista con formación teórica ","PRESENCIAL ","CALI","2019-10-25","8:00 am - 5:00 pm","CRA. 2 NRO. 4 - 29   YUMBO",2,1]
["EMERGENCIAS","Entrenamiento práctico de emergencias  ","Brigadista con formación teórica ","PRESENCIAL ","CARTAGENA","2019-10-25","8:00 am - 5:00 pm","Previo a la actividad se estará confirmando lugar del evento ",2,1]
["EMERGENCIAS","Entrenamiento práctico de emergencias  ","Brigadista con formación teórica ","PRESENCIAL ","MEDELLÍN ","2019-04-05","8:00 am - 5:00 pm","Calle 36 D sur N° 23 -07 Envigado.",4,1]
["EMERGENCIAS","Entrenamiento práctico de emergencias  ","Brigadista con formación teórica ","PRESENCIAL ","MEDELLÍN ","2019-10-18","8:00 am - 5:00 pm","Calle 36 D sur N° 23 -07 Envigado.",4,1]
["EMERGENCIAS","Curso de emergencias.  Módulo 1. Primeros auxilios ","Brigadistas","PRESENCIAL ","BARRANCABERMEJA","2019-04-11","8:00 a.m. - 12:00 m","Hotel San Silvestre Cra 19 # 58a–13",2,1]
["EMERGENCIAS","Curso de emergencias.  Módulo 1. Primeros auxilios ","Brigadistas","PRESENCIAL ","BARRANQUILLA","2019-08-15","8:00 a.m. - 12:00 m","ICONTEC Cra 57 No. 70-89 Barranquilla",3,1]
["EMERGENCIAS","Curso de emergencias.  Módulo 1. Primeros auxilios ","Brigadistas","PRESENCIAL ","BUCARAMANGA","2019-04-11","8:00 a.m. - 12:00 m","CAJASAN Campo Alegre Vía Bucaramanga - Piedecuesta",2,1]
["EMERGENCIAS","Curso de emergencias.  Módulo 1. Primeros auxilios ","Brigadistas","PRESENCIAL ","CALI","2019-04-12","8:00 a.m. - 12:00 m","Av. 5 Norte # 38N-81",2,1]
["EMERGENCIAS","Curso de emergencias.  Módulo 1. Primeros auxilios ","Brigadistas","PRESENCIAL ","CARTAGENA","2019-04-11","8:00 a.m. - 12:00 m","Liberty Seguros, Calle del Arsenal No 8B-195 piso 1",3,1]
["EMERGENCIAS","Curso de emergencias.  Módulo 1. Primeros auxilios ","Brigadistas","PRESENCIAL ","BOGOTÁ","2019-04-11","8:00 a.m. - 12:00 m","Calle 73 N° 10 - 83 Torre C Oficina 302. Salón 302 Fucsia",2,1]
["EMERGENCIAS","Curso de emergencias.  Módulo 1. Primeros auxilios ","Brigadistas","PRESENCIAL ","MEDELLÍN ","2019-04-11","8:00 a.m. - 12:00 m","Carrera 43A No 19-17, auditorio piso 4 torre norte Block Empresarial","(en blanco)",1]
["EMERGENCIAS","Curso de emergencias.  Módulo 2. Evacuación y plan de emergencia.","Brigadistas","PRESENCIAL ","BARRANCABERMEJA","2019-05-16","8:00 a.m. - 12:00 m","Hotel San Silvestre Cra 19 # 58a–13",2,1]
["EMERGENCIAS","Curso de emergencias.  Módulo 2. Evacuación y plan de emergencia.","Brigadistas","PRESENCIAL ","BARRANQUILLA","2019-09-05","8:00 a.m. - 12:00 m","ICONTEC Cra 57 No. 70-89 Barranquilla",3,1]
["EMERGENCIAS","Curso de emergencias.  Módulo 2. Evacuación y plan de emergencia.","Brigadistas","PRESENCIAL ","BUCARAMANGA","2019-05-16","8:00 a.m. - 12:00 m","CAJASAN Campo Alegre Vía Bucaramanga - Piedecuesta",2,1]
["EMERGENCIAS","Curso de emergencias.  Módulo 2. Evacuación y plan de emergencia.","Brigadistas","PRESENCIAL ","CALI","2019-05-17","8:00 a.m. - 12:00 m","Av. 5 Norte # 38N-81",2,1]
["EMERGENCIAS","Curso de emergencias.  Módulo 2. Evacuación y plan de emergencia.","Brigadistas","PRESENCIAL ","CARTAGENA","2019-05-16","8:00 a.m. - 12:00 m","Liberty Seguros, Calle del Arsenal No 8B-195 piso 1",3,1]
["EMERGENCIAS","Curso de emergencias.  Módulo 2. Evacuación y plan de emergencia.","Brigadistas","PRESENCIAL ","BOGOTÁ","2019-05-16","8:00 a.m. - 12:00 m","Calle 73 N° 10 - 83 Torre C Oficina 302. Salón 302 Fucsia",2,1]
["EMERGENCIAS","Curso de emergencias.  Módulo 2. Evacuación y plan de emergencia.","Brigadistas","PRESENCIAL ","MEDELLÍN ","2019-05-16","8:00 a.m. - 12:00 m","Carrera 43A No 19-17, auditorio piso 4 torre norte Block Empresarial","(en blanco)",1]
["EMERGENCIAS","Curso de emergencias.  Módulo 3. Contraincendio y recursos para emergencias.  ","Brigadistas","PRESENCIAL ","BARRANCABERMEJA","2019-06-13","8:00 a.m. - 12:00 m","Hotel San Silvestre Cra 19 # 58a–13",2,1]
["EMERGENCIAS","Curso de emergencias.  Módulo 3. Contraincendio y recursos para emergencias.  ","Brigadistas","PRESENCIAL ","BARRANQUILLA","2019-09-19","8:00 a.m. - 12:00 m","ICONTEC Cra 57 No. 70-89 Barranquilla",3,1]
["EMERGENCIAS","Curso de emergencias.  Módulo 3. Contraincendio y recursos para emergencias.  ","Brigadistas","PRESENCIAL ","BUCARAMANGA","2019-06-13","8:00 a.m. - 12:00 m","CAJASAN Campo Alegre Vía Bucaramanga - Piedecuesta",2,1]
["EMERGENCIAS","Curso de emergencias.  Módulo 3. Contraincendio y recursos para emergencias.  ","Brigadistas","PRESENCIAL ","CALI","2019-06-14","8:00 a.m. - 12:00 m","Av. 5 Norte # 38N-81",2,1]
["EMERGENCIAS","Curso de emergencias.  Módulo 3. Contraincendio y recursos para emergencias.  ","Brigadistas","PRESENCIAL ","CARTAGENA","2019-06-13","8:00 a.m. - 12:00 m","Liberty Seguros, Calle del Arsenal No 8B-195 piso 1",3,1]
["EMERGENCIAS","Curso de emergencias.  Módulo 3. Contraincendio y recursos para emergencias.  ","Brigadistas","PRESENCIAL ","BOGOTÁ","2019-06-13","8:00 a.m. - 12:00 m","Calle 73 N° 10 - 83 Torre C Oficina 302. Salón 302 Fucsia",2,1]
["EMERGENCIAS","Curso de emergencias.  Módulo 3. Contraincendio y recursos para emergencias.  ","Brigadistas","PRESENCIAL ","MEDELLÍN ","2019-06-13","8:00 a.m. - 12:00 m","Carrera 43A No 19-17, auditorio piso 4 torre norte Block Empresarial","(en blanco)",1]
["EMERGENCIAS","Entrenamiento práctico de emergencias","Brigadista con formación teórica ","PRESENCIAL ","BOGOTÁ","2019-07-26","8:00 am - 5:00 pm","Pista San José ",2,1]
["EMERGENCIAS","Entrenamiento práctico de emergencias","Brigadista con formación teórica ","PRESENCIAL ","BOGOTÁ","2019-04-26","8:00 am - 5:00 pm","Pista San José ",2,1]
["ENTRENAMIENTO GERENCIAL ","Estabilidad laboral reforzada un reto organizacional","Gerentes de empresas afiliadas","PRESENCIAL ","BARRANCABERMEJA","2019-03-14","8:00 am - 10:00 a.m.","Hotel San Silvestre Cra 19 # 58a–13",2,1]
["ENTRENAMIENTO GERENCIAL ","Estabilidad laboral reforzada un reto organizacional","Gerentes de empresas afiliadas","PRESENCIAL ","BARRANQUILLA","2019-03-19","8:00 am - 10:00 a.m.","ICONTEC Cra 57 No. 70-89 Barranquilla",3,1]
["ENTRENAMIENTO GERENCIAL ","Estabilidad laboral reforzada un reto organizacional","Gerentes de empresas afiliadas","PRESENCIAL ","BUCARAMANGA","2019-03-07","8:00 am - 10:00 a.m.","Hotel La Triada Cra. 20 #34--22",2,1]
["ENTRENAMIENTO GERENCIAL ","Estabilidad laboral reforzada un reto organizacional","Gerentes de empresas afiliadas","PRESENCIAL ","CALI","2019-03-14","8:00 am - 10:00 a.m.","Club de Ejecutivos Av. 4N # 23DN - 65 Piso 9",2,1]
["ENTRENAMIENTO GERENCIAL ","Estabilidad laboral reforzada un reto organizacional","Gerentes de empresas afiliadas","PRESENCIAL ","CARTAGENA","2019-03-07","8:00 am - 10:00 a.m.","Liberty Seguros, Calle del Arsenal No 8B-195 piso 1",2,1]
["ENTRENAMIENTO GERENCIAL ","Estabilidad laboral reforzada un reto organizacional","Gerentes de empresas afiliadas","PRESENCIAL ","BOGOTÁ","2019-08-28","8:00 am - 10:00 a.m.","Calle 73 N° 10 - 83 Torre C Oficina 302. Salón 302 Fucsia",2,1]
["ENTRENAMIENTO GERENCIAL ","Estabilidad laboral reforzada un reto organizacional","Gerentes empresas afiliadas ARL Liberty ","PRESENCIAL ","BOGOTÁ","2019-03-07","8:00 am - 10:00 a.m.","Calle 72 # 10 -07   AUDITORIO Piso 6",2,1]
["ENTRENAMIENTO GERENCIAL ","Rentabilidad en seguridad y salud en el trabajo. ","Gerentes de empresas afiliadas","PRESENCIAL ","BOGOTÁ","2019-06-20","8:00 am - 10:00 a.m.","Calle 72 # 10 -07   AUDITORIO Piso 6",2,1]
["ENTRENAMIENTO GERENCIAL ","Tendencias globales en Seguridad y salud en el trabajo ","Gerentes de empresas afiliadas","PRESENCIAL ","BUCARAMANGA","2019-08-22","8:00 am - 10:00 a.m.","Hotel La Triada Cra. 20 #34--22",2,1]
["ENTRENAMIENTO GERENCIAL ","Tendencias globales en Seguridad y salud en el trabajo ","Gerentes de empresas afiliadas","PRESENCIAL ","CALI","2019-08-22","8:00 am - 10:00 a.m.","Club de Ejecutivos Av. 4N # 23DN - 65 Piso 9\n",2,1]
["ENTRENAMIENTO GERENCIAL ","Tendencias globales en Seguridad y salud en el trabajo ","Gerentes de empresas afiliadas","PRESENCIAL ","MEDELLÍN ","2019-09-19","8:00 am - 10:00 a.m.","Previo a la actividad se estará confirmando lugar del evento ",2,1]
["ENTRENAMIENTO GERENCIAL ","continuidad y sostenibilidad del negocio desde SST","Gerentes de empresas afiliadas","PRESENCIAL ","MEDELLÍN ","2019-05-16","8:00 am - 10:00 a.m.","Previo a la actividad se estará confirmando lugar del evento ",2,1]
["ENTRENAMIENTO GERENCIAL ","Sostenibilidad: Una fuerza transformadora de la seguridad y salud en el trabajo.","Gerentes de empresas afiliadas","PRESENCIAL ","BOGOTÁ","2019-11-28","8:00 am - 10:00 a.m.","Calle 73 N° 10 - 83 Torre C Oficina 302. Salón 302 Fucsia",2,1]
["ENTRENAMIENTOS ADMINISTRATIVOS","Capacitación para independientes y afiliados sobre los deberes y derechos en el  SGRL y definiciones según normatividad","Empresas  e independientes voluntarios - mayor información en:\nAtención al cliente - tel. 3077050 ","PRESENCIAL ","BARRANQUILLA","2019-01-23","8:00 AM - 11:00A M","Calle 77 No. 59 - 35 OFC 1403 CENTRO EMPRESARIAL AMERICAS 3",3,1]
["ENTRENAMIENTOS ADMINISTRATIVOS","Capacitación para independientes y afiliados sobre los deberes y derechos en el  SGRL y definiciones según normatividad","Empresas  e independientes voluntarios - mayor información en:\nAtención al cliente - tel. 3077050 ","PRESENCIAL ","BARRANQUILLA","2019-02-13","8:00 AM - 11:00A M","Calle 77 No. 59 - 35 OFC 1403 CENTRO EMPRESARIAL AMERICAS 3",3,1]
["ENTRENAMIENTOS ADMINISTRATIVOS","Capacitación para independientes y afiliados sobre los deberes y derechos en el  SGRL y definiciones según normatividad","Empresas  e independientes voluntarios - mayor información en:\nAtención al cliente - tel. 3077050 ","PRESENCIAL ","BARRANQUILLA","2019-03-13","8:00 AM - 11:00A M","Calle 77 No. 59 - 35 OFC 1403 CENTRO EMPRESARIAL AMERICAS 3",3,1]
["ENTRENAMIENTOS ADMINISTRATIVOS","Capacitación para independientes y afiliados sobre los deberes y derechos en el  SGRL y definiciones según normatividad","Empresas  e independientes voluntarios - mayor información en:\nAtención al cliente - tel. 3077050 ","PRESENCIAL ","BARRANQUILLA","2019-04-10","8:00 AM - 11:00A M","Calle 77 No. 59 - 35 OFC 1403 CENTRO EMPRESARIAL AMERICAS 3",3,1]
["ENTRENAMIENTOS ADMINISTRATIVOS","Capacitación para independientes y afiliados sobre los deberes y derechos en el  SGRL y definiciones según normatividad","Empresas  e independientes voluntarios - mayor información en:\nAtención al cliente - tel. 3077050 ","PRESENCIAL ","BARRANQUILLA","2019-05-15","8:00 AM - 11:00A M","Calle 77 No. 59 - 35 OFC 1403 CENTRO EMPRESARIAL AMERICAS 3",3,1]
["ENTRENAMIENTOS ADMINISTRATIVOS","Capacitación para independientes y afiliados sobre los deberes y derechos en el  SGRL y definiciones según normatividad","Empresas  e independientes voluntarios - mayor información en:\nAtención al cliente - tel. 3077050 ","PRESENCIAL ","BARRANQUILLA","2019-06-12","8:00 AM - 11:00A M","Calle 77 No. 59 - 35 OFC 1403 CENTRO EMPRESARIAL AMERICAS 3",3,1]
["ENTRENAMIENTOS ADMINISTRATIVOS","Capacitación para independientes y afiliados sobre los deberes y derechos en el  SGRL y definiciones según normatividad","Empresas  e independientes voluntarios - mayor información en:\nAtención al cliente - tel. 3077050 ","PRESENCIAL ","BARRANQUILLA","2019-07-17","8:00 AM - 11:00A M","Calle 77 No. 59 - 35 OFC 1403 CENTRO EMPRESARIAL AMERICAS 3",3,1]
["ENTRENAMIENTOS ADMINISTRATIVOS","Capacitación para independientes y afiliados sobre los deberes y derechos en el  SGRL y definiciones según normatividad","Empresas  e independientes voluntarios - mayor información en:\nAtención al cliente - tel. 3077050 ","PRESENCIAL ","BARRANQUILLA","2019-08-14","8:00 AM - 11:00A M","Calle 77 No. 59 - 35 OFC 1403 CENTRO EMPRESARIAL AMERICAS 3",3,1]
["ENTRENAMIENTOS ADMINISTRATIVOS","Capacitación para independientes y afiliados sobre los deberes y derechos en el  SGRL y definiciones según normatividad","Empresas  e independientes voluntarios - mayor información en:\nAtención al cliente - tel. 3077050 ","PRESENCIAL ","BARRANQUILLA","2019-09-11","8:00 AM - 11:00A M","Calle 77 No. 59 - 35 OFC 1403 CENTRO EMPRESARIAL AMERICAS 3",3,1]
["ENTRENAMIENTOS ADMINISTRATIVOS","Capacitación para independientes y afiliados sobre los deberes y derechos en el  SGRL y definiciones según normatividad","Empresas  e independientes voluntarios - mayor información en:\nAtención al cliente - tel. 3077050 ","PRESENCIAL ","BARRANQUILLA","2019-10-09","8:00 AM - 11:00A M","Calle 77 No. 59 - 35 OFC 1403 CENTRO EMPRESARIAL AMERICAS 3",3,1]
["ENTRENAMIENTOS ADMINISTRATIVOS","Capacitación para independientes y afiliados sobre los deberes y derechos en el  SGRL y definiciones según normatividad","Empresas  e independientes voluntarios - mayor información en:\nAtención al cliente - tel. 3077050 ","PRESENCIAL ","BARRANQUILLA","2019-12-11","8:00 AM - 11:00A M","Calle 77 No. 59 - 35 OFC 1403 CENTRO EMPRESARIAL AMERICAS 3",3,1]
["ENTRENAMIENTOS ADMINISTRATIVOS","Capacitación para independientes y afiliados sobre los deberes y derechos en el  SGRL y definiciones según normatividad","Empresas  e independientes voluntarios - mayor información en:\nAtención al cliente - tel. 3077050 ","PRESENCIAL ","BUCARAMANGA","2019-01-23","8:00 AM - 11:00A M","Transv. Oriental No 90-102 Torre Empresarial Cacique Oficinas  703 – 704",2,1]
["ENTRENAMIENTOS ADMINISTRATIVOS","Capacitación para independientes y afiliados sobre los deberes y derechos en el  SGRL y definiciones según normatividad","Empresas  e independientes voluntarios - mayor información en:\nAtención al cliente - tel. 3077050 ","PRESENCIAL ","BUCARAMANGA","2019-02-13","8:00 AM - 11:00A M","Transv. Oriental No 90-102 Torre Empresarial Cacique Oficinas  703 – 704",2,1]
["ENTRENAMIENTOS ADMINISTRATIVOS","Capacitación para independientes y afiliados sobre los deberes y derechos en el  SGRL y definiciones según normatividad","Empresas  e independientes voluntarios - mayor información en:\nAtención al cliente - tel. 3077050 ","PRESENCIAL ","BUCARAMANGA","2019-03-13","8:00 AM - 11:00A M","Transv. Oriental No 90-102 Torre Empresarial Cacique Oficinas  703 – 704",2,1]
["ENTRENAMIENTOS ADMINISTRATIVOS","Capacitación para independientes y afiliados sobre los deberes y derechos en el  SGRL y definiciones según normatividad","Empresas  e independientes voluntarios - mayor información en:\nAtención al cliente - tel. 3077050 ","PRESENCIAL ","BUCARAMANGA","2019-04-10","8:00 AM - 11:00A M","Transv. Oriental No 90-102 Torre Empresarial Cacique Oficinas  703 – 704",2,1]
["ENTRENAMIENTOS ADMINISTRATIVOS","Capacitación para independientes y afiliados sobre los deberes y derechos en el  SGRL y definiciones según normatividad","Empresas  e independientes voluntarios - mayor información en:\nAtención al cliente - tel. 3077050 ","PRESENCIAL ","BUCARAMANGA","2019-05-15","8:00 AM - 11:00A M","Transv. Oriental No 90-102 Torre Empresarial Cacique Oficinas  703 – 704",2,1]
["ENTRENAMIENTOS ADMINISTRATIVOS","Capacitación para independientes y afiliados sobre los deberes y derechos en el  SGRL y definiciones según normatividad","Empresas  e independientes voluntarios - mayor información en:\nAtención al cliente - tel. 3077050 ","PRESENCIAL ","BUCARAMANGA","2019-06-12","8:00 AM - 11:00A M","Transv. Oriental No 90-102 Torre Empresarial Cacique Oficinas  703 – 704",2,1]
["ENTRENAMIENTOS ADMINISTRATIVOS","Capacitación para independientes y afiliados sobre los deberes y derechos en el  SGRL y definiciones según normatividad","Empresas  e independientes voluntarios - mayor información en:\nAtención al cliente - tel. 3077050 ","PRESENCIAL ","BUCARAMANGA","2019-07-17","8:00 AM - 11:00A M","Transv. Oriental No 90-102 Torre Empresarial Cacique Oficinas  703 – 704",2,1]
["ENTRENAMIENTOS ADMINISTRATIVOS","Capacitación para independientes y afiliados sobre los deberes y derechos en el  SGRL y definiciones según normatividad","Empresas  e independientes voluntarios - mayor información en:\nAtención al cliente - tel. 3077050 ","PRESENCIAL ","BUCARAMANGA","2019-08-14","8:00 AM - 11:00A M","Transv. Oriental No 90-102 Torre Empresarial Cacique Oficinas  703 – 704",2,1]
["ENTRENAMIENTOS ADMINISTRATIVOS","Capacitación para independientes y afiliados sobre los deberes y derechos en el  SGRL y definiciones según normatividad","Empresas  e independientes voluntarios - mayor información en:\nAtención al cliente - tel. 3077050 ","PRESENCIAL ","BUCARAMANGA","2019-09-11","8:00 AM - 11:00A M","Transv. Oriental No 90-102 Torre Empresarial Cacique Oficinas  703 – 704",2,1]
["ENTRENAMIENTOS ADMINISTRATIVOS","Capacitación para independientes y afiliados sobre los deberes y derechos en el  SGRL y definiciones según normatividad","Empresas  e independientes voluntarios - mayor información en:\nAtención al cliente - tel. 3077050 ","PRESENCIAL ","BUCARAMANGA","2019-10-09","8:00 AM - 11:00A M","Transv. Oriental No 90-102 Torre Empresarial Cacique Oficinas  703 – 704",2,1]
["ENTRENAMIENTOS ADMINISTRATIVOS","Capacitación para independientes y afiliados sobre los deberes y derechos en el  SGRL y definiciones según normatividad","Empresas  e independientes voluntarios - mayor información en:\nAtención al cliente - tel. 3077050 ","PRESENCIAL ","BUCARAMANGA","2019-12-11","8:00 AM - 11:00A M","Transv. Oriental No 90-102 Torre Empresarial Cacique Oficinas  703 – 704",2,1]
["ENTRENAMIENTOS ADMINISTRATIVOS","Capacitación para independientes y afiliados sobre los deberes y derechos en el  SGRL y definiciones según normatividad","Empresas  e independientes voluntarios - mayor información en:\nAtención al cliente - tel. 3077050 ","PRESENCIAL ","CALI","2019-01-23","8:00 AM - 11:00A M","Cr 36 Norte No. 6A - 65 Piso 23, Oficina 2301",2,1]
["ENTRENAMIENTOS ADMINISTRATIVOS","Capacitación para independientes y afiliados sobre los deberes y derechos en el  SGRL y definiciones según normatividad","Empresas  e independientes voluntarios - mayor información en:\nAtención al cliente - tel. 3077050 ","PRESENCIAL ","CALI","2019-02-13","8:00 AM - 11:00A M","Cr 36 Norte No. 6A - 65 Piso 23, Oficina 2301",2,1]
["ENTRENAMIENTOS ADMINISTRATIVOS","Capacitación para independientes y afiliados sobre los deberes y derechos en el  SGRL y definiciones según normatividad","Empresas  e independientes voluntarios - mayor información en:\nAtención al cliente - tel. 3077050 ","PRESENCIAL ","CALI","2019-03-13","8:00 AM - 11:00A M","Cr 36 Norte No. 6A - 65 Piso 23, Oficina 2301",2,1]
["ENTRENAMIENTOS ADMINISTRATIVOS","Capacitación para independientes y afiliados sobre los deberes y derechos en el  SGRL y definiciones según normatividad","Empresas  e independientes voluntarios - mayor información en:\nAtención al cliente - tel. 3077050 ","PRESENCIAL ","CALI","2019-04-10","8:00 AM - 11:00A M","Cr 36 Norte No. 6A - 65 Piso 23, Oficina 2301",2,1]
["ENTRENAMIENTOS ADMINISTRATIVOS","Capacitación para independientes y afiliados sobre los deberes y derechos en el  SGRL y definiciones según normatividad","Empresas  e independientes voluntarios - mayor información en:\nAtención al cliente - tel. 3077050 ","PRESENCIAL ","CALI","2019-05-15","8:00 AM - 11:00A M","Cr 36 Norte No. 6A - 65 Piso 23, Oficina 2301",2,1]
["ENTRENAMIENTOS ADMINISTRATIVOS","Capacitación para independientes y afiliados sobre los deberes y derechos en el  SGRL y definiciones según normatividad","Empresas  e independientes voluntarios - mayor información en:\nAtención al cliente - tel. 3077050 ","PRESENCIAL ","CALI","2019-06-12","8:00 AM - 11:00A M","Cr 36 Norte No. 6A - 65 Piso 23, Oficina 2301",2,1]
["ENTRENAMIENTOS ADMINISTRATIVOS","Capacitación para independientes y afiliados sobre los deberes y derechos en el  SGRL y definiciones según normatividad","Empresas  e independientes voluntarios - mayor información en:\nAtención al cliente - tel. 3077050 ","PRESENCIAL ","CALI","2019-07-17","8:00 AM - 11:00A M","Cr 36 Norte No. 6A - 65 Piso 23, Oficina 2301",2,1]
["ENTRENAMIENTOS ADMINISTRATIVOS","Capacitación para independientes y afiliados sobre los deberes y derechos en el  SGRL y definiciones según normatividad","Empresas  e independientes voluntarios - mayor información en:\nAtención al cliente - tel. 3077050 ","PRESENCIAL ","CALI","2019-08-14","8:00 AM - 11:00A M","Cr 36 Norte No. 6A - 65 Piso 23, Oficina 2301",2,1]
["ENTRENAMIENTOS ADMINISTRATIVOS","Capacitación para independientes y afiliados sobre los deberes y derechos en el  SGRL y definiciones según normatividad","Empresas  e independientes voluntarios - mayor información en:\nAtención al cliente - tel. 3077050 ","PRESENCIAL ","CALI","2019-09-11","8:00 AM - 11:00A M","Cr 36 Norte No. 6A - 65 Piso 23, Oficina 2301",2,1]
["ENTRENAMIENTOS ADMINISTRATIVOS","Capacitación para independientes y afiliados sobre los deberes y derechos en el  SGRL y definiciones según normatividad","Empresas  e independientes voluntarios - mayor información en:\nAtención al cliente - tel. 3077050 ","PRESENCIAL ","CALI","2019-10-09","8:00 AM - 11:00A M","Cr 36 Norte No. 6A - 65 Piso 23, Oficina 2301",2,1]
["ENTRENAMIENTOS ADMINISTRATIVOS","Capacitación para independientes y afiliados sobre los deberes y derechos en el  SGRL y definiciones según normatividad","Empresas  e independientes voluntarios - mayor información en:\nAtención al cliente - tel. 3077050 ","PRESENCIAL ","CALI","2019-12-11","8:00 AM - 11:00A M","Cr 36 Norte No. 6A - 65 Piso 23, Oficina 2301",2,1]
["ENTRENAMIENTOS ADMINISTRATIVOS","Capacitación para independientes y afiliados sobre los deberes y derechos en el  SGRL y definiciones según normatividad","Empresas  e independientes voluntarios - mayor información en:\nAtención al cliente - tel. 3077050 ","PRESENCIAL ","CARTAGENA","2019-01-23","8:00 AM - 11:00A M","Liberty Seguros, Calle del Arsenal No 8B-195 piso 1",2,1]
["ENTRENAMIENTOS ADMINISTRATIVOS","Capacitación para independientes y afiliados sobre los deberes y derechos en el  SGRL y definiciones según normatividad","Empresas  e independientes voluntarios - mayor información en:\nAtención al cliente - tel. 3077050 ","PRESENCIAL ","CARTAGENA","2019-02-13","8:00 AM - 11:00A M","Liberty Seguros, Calle del Arsenal No 8B-195 piso 1",2,1]
["ENTRENAMIENTOS ADMINISTRATIVOS","Capacitación para independientes y afiliados sobre los deberes y derechos en el  SGRL y definiciones según normatividad","Empresas  e independientes voluntarios - mayor información en:\nAtención al cliente - tel. 3077050 ","PRESENCIAL ","CARTAGENA","2019-03-13","8:00 AM - 11:00A M","Liberty Seguros, Calle del Arsenal No 8B-195 piso 1",2,1]
["ENTRENAMIENTOS ADMINISTRATIVOS","Capacitación para independientes y afiliados sobre los deberes y derechos en el  SGRL y definiciones según normatividad","Empresas  e independientes voluntarios - mayor información en:\nAtención al cliente - tel. 3077050 ","PRESENCIAL ","CARTAGENA","2019-04-10","8:00 AM - 11:00A M","Liberty Seguros, Calle del Arsenal No 8B-195 piso 1",2,1]
["ENTRENAMIENTOS ADMINISTRATIVOS","Capacitación para independientes y afiliados sobre los deberes y derechos en el  SGRL y definiciones según normatividad","Empresas  e independientes voluntarios - mayor información en:\nAtención al cliente - tel. 3077050 ","PRESENCIAL ","CARTAGENA","2019-05-15","8:00 AM - 11:00A M","Liberty Seguros, Calle del Arsenal No 8B-195 piso 1",2,1]
["ENTRENAMIENTOS ADMINISTRATIVOS","Capacitación para independientes y afiliados sobre los deberes y derechos en el  SGRL y definiciones según normatividad","Empresas  e independientes voluntarios - mayor información en:\nAtención al cliente - tel. 3077050 ","PRESENCIAL ","CARTAGENA","2019-06-12","8:00 AM - 11:00A M","Liberty Seguros, Calle del Arsenal No 8B-195 piso 1",2,1]
["ENTRENAMIENTOS ADMINISTRATIVOS","Capacitación para independientes y afiliados sobre los deberes y derechos en el  SGRL y definiciones según normatividad","Empresas  e independientes voluntarios - mayor información en:\nAtención al cliente - tel. 3077050 ","PRESENCIAL ","CARTAGENA","2019-07-17","8:00 AM - 11:00A M","Liberty Seguros, Calle del Arsenal No 8B-195 piso 1",2,1]
["ENTRENAMIENTOS ADMINISTRATIVOS","Capacitación para independientes y afiliados sobre los deberes y derechos en el  SGRL y definiciones según normatividad","Empresas  e independientes voluntarios - mayor información en:\nAtención al cliente - tel. 3077050 ","PRESENCIAL ","CARTAGENA","2019-08-14","8:00 AM - 11:00A M","Liberty Seguros, Calle del Arsenal No 8B-195 piso 1",2,1]
["ENTRENAMIENTOS ADMINISTRATIVOS","Capacitación para independientes y afiliados sobre los deberes y derechos en el  SGRL y definiciones según normatividad","Empresas  e independientes voluntarios - mayor información en:\nAtención al cliente - tel. 3077050 ","PRESENCIAL ","CARTAGENA","2019-09-11","8:00 AM - 11:00A M","Liberty Seguros, Calle del Arsenal No 8B-195 piso 1",2,1]
["ENTRENAMIENTOS ADMINISTRATIVOS","Capacitación para independientes y afiliados sobre los deberes y derechos en el  SGRL y definiciones según normatividad","Empresas  e independientes voluntarios - mayor información en:\nAtención al cliente - tel. 3077050 ","PRESENCIAL ","CARTAGENA","2019-10-09","8:00 AM - 11:00A M","Liberty Seguros, Calle del Arsenal No 8B-195 piso 1",2,1]
["ENTRENAMIENTOS ADMINISTRATIVOS","Capacitación para independientes y afiliados sobre los deberes y derechos en el  SGRL y definiciones según normatividad","Empresas  e independientes voluntarios - mayor información en:\nAtención al cliente - tel. 3077050 ","PRESENCIAL ","CARTAGENA","2019-12-11","8:00 AM - 11:00A M","Liberty Seguros, Calle del Arsenal No 8B-195 piso 1",2,1]
["ENTRENAMIENTOS ADMINISTRATIVOS","Capacitación para independientes y afiliados sobre los deberes y derechos en el  SGRL y definiciones según normatividad","Empresas  e independientes voluntarios - mayor información en:\nAtención al cliente - tel. 3077050 ","PRESENCIAL ","BOGOTÁ","2019-01-23","8:00 AM - 11:00A M","Calle 72 N. 10 - 07 ",2,1]
["ENTRENAMIENTOS ADMINISTRATIVOS","Capacitación para independientes y afiliados sobre los deberes y derechos en el  SGRL y definiciones según normatividad","Empresas  e independientes voluntarios - mayor información en:\nAtención al cliente - tel. 3077050 ","PRESENCIAL ","BOGOTÁ","2019-02-13","8:00 AM - 11:00A M","Calle 73 N° 10 - 83 Torre C Oficina 302. Salón 302 Fucsia",2,1]
["ENTRENAMIENTOS ADMINISTRATIVOS","Capacitación para independientes y afiliados sobre los deberes y derechos en el  SGRL y definiciones según normatividad","Empresas  e independientes voluntarios - mayor información en:\nAtención al cliente - tel. 3077050 ","PRESENCIAL ","BOGOTÁ","2019-03-13","8:00 AM - 11:00A M","Calle 73 N° 10 - 83 Torre C Oficina 302. Salón 302 Fucsia",2,1]
["ENTRENAMIENTOS ADMINISTRATIVOS","Capacitación para independientes y afiliados sobre los deberes y derechos en el  SGRL y definiciones según normatividad","Empresas  e independientes voluntarios - mayor información en:\nAtención al cliente - tel. 3077050 ","PRESENCIAL ","BOGOTÁ","2019-04-10","8:00 AM - 11:00A M","Calle 73 N° 10 - 83 Torre C Oficina 302. Salón 302 Fucsia",2,1]
["ENTRENAMIENTOS ADMINISTRATIVOS","Capacitación para independientes y afiliados sobre los deberes y derechos en el  SGRL y definiciones según normatividad","Empresas  e independientes voluntarios - mayor información en:\nAtención al cliente - tel. 3077050 ","PRESENCIAL ","BOGOTÁ","2019-05-15","8:00 AM - 11:00A M","Calle 73 N° 10 - 83 Torre C Oficina 302. Salón 302 Fucsia",2,1]
["ENTRENAMIENTOS ADMINISTRATIVOS","Capacitación para independientes y afiliados sobre los deberes y derechos en el  SGRL y definiciones según normatividad","Empresas  e independientes voluntarios - mayor información en:\nAtención al cliente - tel. 3077050 ","PRESENCIAL ","BOGOTÁ","2019-06-12","8:00 AM - 11:00A M","Calle 73 N° 10 - 83 Torre C Oficina 302. Salón 302 Fucsia",2,1]
["ENTRENAMIENTOS ADMINISTRATIVOS","Capacitación para independientes y afiliados sobre los deberes y derechos en el  SGRL y definiciones según normatividad","Empresas  e independientes voluntarios - mayor información en:\nAtención al cliente - tel. 3077050 ","PRESENCIAL ","BOGOTÁ","2019-07-17","8:00 AM - 11:00A M","Calle 73 N° 10 - 83 Torre C Oficina 302. Salón 302 Fucsia",2,1]
["ENTRENAMIENTOS ADMINISTRATIVOS","Capacitación para independientes y afiliados sobre los deberes y derechos en el  SGRL y definiciones según normatividad","Empresas  e independientes voluntarios - mayor información en:\nAtención al cliente - tel. 3077050 ","PRESENCIAL ","BOGOTÁ","2019-08-14","8:00 AM - 11:00A M","Calle 73 N° 10 - 83 Torre C Oficina 302. Salón 302 Fucsia",2,1]
["ENTRENAMIENTOS ADMINISTRATIVOS","Capacitación para independientes y afiliados sobre los deberes y derechos en el  SGRL y definiciones según normatividad","Empresas  e independientes voluntarios - mayor información en:\nAtención al cliente - tel. 3077050 ","PRESENCIAL ","BOGOTÁ","2019-09-11","8:00 AM - 11:00A M","Calle 73 N° 10 - 83 Torre C Oficina 302. Salón 302 Fucsia",2,1]
["ENTRENAMIENTOS ADMINISTRATIVOS","Capacitación para independientes y afiliados sobre los deberes y derechos en el  SGRL y definiciones según normatividad","Empresas  e independientes voluntarios - mayor información en:\nAtención al cliente - tel. 3077050 ","PRESENCIAL ","BOGOTÁ","2019-10-09","8:00 AM - 11:00A M","Calle 73 N° 10 - 83 Torre C Oficina 302. Salón 302 Fucsia",2,1]
["ENTRENAMIENTOS ADMINISTRATIVOS","Capacitación para independientes y afiliados sobre los deberes y derechos en el  SGRL y definiciones según normatividad","Empresas  e independientes voluntarios - mayor información en:\nAtención al cliente - tel. 3077050 ","PRESENCIAL ","BOGOTÁ","2019-12-11","8:00 AM - 11:00A M","Calle 73 N° 10 - 83 Torre C Oficina 302. Salón 302 Fucsia",2,1]
["ENTRENAMIENTOS ADMINISTRATIVOS","Capacitación para independientes y afiliados sobre los deberes y derechos en el  SGRL y definiciones según normatividad","Empresas  e independientes voluntarios - mayor información en:\nAtención al cliente - tel. 3077050 ","PRESENCIAL ","MEDELLÍN ","2019-01-23","8:00 AM - 11:00A M","Cra 43A No. 19-17, Piso 15",2,1]
["ENTRENAMIENTOS ADMINISTRATIVOS","Capacitación para independientes y afiliados sobre los deberes y derechos en el  SGRL y definiciones según normatividad","Empresas  e independientes voluntarios - mayor información en:\nAtención al cliente - tel. 3077050 ","PRESENCIAL ","MEDELLÍN ","2019-02-13","8:00 AM - 11:00A M","Cra 43A No. 19-17, Piso 15",2,1]
["ENTRENAMIENTOS ADMINISTRATIVOS","Capacitación para independientes y afiliados sobre los deberes y derechos en el  SGRL y definiciones según normatividad","Empresas  e independientes voluntarios - mayor información en:\nAtención al cliente - tel. 3077050 ","PRESENCIAL ","MEDELLÍN ","2019-03-13","8:00 AM - 11:00A M","Cra 43A No. 19-17, Piso 15",2,1]
["ENTRENAMIENTOS ADMINISTRATIVOS","Capacitación para independientes y afiliados sobre los deberes y derechos en el  SGRL y definiciones según normatividad","Empresas  e independientes voluntarios - mayor información en:\nAtención al cliente - tel. 3077050 ","PRESENCIAL ","MEDELLÍN ","2019-04-10","8:00 AM - 11:00A M","Cra 43A No. 19-17, Piso 15",2,1]
["ENTRENAMIENTOS ADMINISTRATIVOS","Capacitación para independientes y afiliados sobre los deberes y derechos en el  SGRL y definiciones según normatividad","Empresas  e independientes voluntarios - mayor información en:\nAtención al cliente - tel. 3077050 ","PRESENCIAL ","MEDELLÍN ","2019-05-15","8:00 AM - 11:00A M","Cra 43A No. 19-17, Piso 15",2,1]
["ENTRENAMIENTOS ADMINISTRATIVOS","Capacitación para independientes y afiliados sobre los deberes y derechos en el  SGRL y definiciones según normatividad","Empresas  e independientes voluntarios - mayor información en:\nAtención al cliente - tel. 3077050 ","PRESENCIAL ","MEDELLÍN ","2019-06-12","8:00 AM - 11:00A M","Cra 43A No. 19-17, Piso 15",2,1]
["ENTRENAMIENTOS ADMINISTRATIVOS","Capacitación para independientes y afiliados sobre los deberes y derechos en el  SGRL y definiciones según normatividad","Empresas  e independientes voluntarios - mayor información en:\nAtención al cliente - tel. 3077050 ","PRESENCIAL ","MEDELLÍN ","2019-07-17","8:00 AM - 11:00A M","Cra 43A No. 19-17, Piso 15",2,1]
["ENTRENAMIENTOS ADMINISTRATIVOS","Capacitación para independientes y afiliados sobre los deberes y derechos en el  SGRL y definiciones según normatividad","Empresas  e independientes voluntarios - mayor información en:\nAtención al cliente - tel. 3077050 ","PRESENCIAL ","MEDELLÍN ","2019-08-14","8:00 AM - 11:00A M","Cra 43A No. 19-17, Piso 15",2,1]
["ENTRENAMIENTOS ADMINISTRATIVOS","Capacitación para independientes y afiliados sobre los deberes y derechos en el  SGRL y definiciones según normatividad","Empresas  e independientes voluntarios - mayor información en:\nAtención al cliente - tel. 3077050 ","PRESENCIAL ","MEDELLÍN ","2019-09-11","8:00 AM - 11:00A M","Cra 43A No. 19-17, Piso 15",2,1]
["ENTRENAMIENTOS ADMINISTRATIVOS","Capacitación para independientes y afiliados sobre los deberes y derechos en el  SGRL y definiciones según normatividad","Empresas  e independientes voluntarios - mayor información en:\nAtención al cliente - tel. 3077050 ","PRESENCIAL ","MEDELLÍN ","2019-10-09","8:00 AM - 11:00A M","Cra 43A No. 19-17, Piso 15",2,1]
["ENTRENAMIENTOS ADMINISTRATIVOS","Capacitación para independientes y afiliados sobre los deberes y derechos en el  SGRL y definiciones según normatividad","Empresas  e independientes voluntarios - mayor información en:\nAtención al cliente - tel. 3077050 ","PRESENCIAL ","MEDELLÍN ","2019-12-11","8:00 AM - 11:00A M","Cra 43A No. 19-17, Piso 15",2,1]
["ENTRENAMIENTOS PÁGINA WEB","Capacitación Web Masiva empresas activas","Empresas afiliadas a ARL Liberty  ","VIRTUAL ","NACIONAL","2019-02-14","8:30 AM - 10:30A M","Liberty University",200,1]
["ENTRENAMIENTOS PÁGINA WEB","Capacitación Web Masiva empresas activas","Empresas afiliadas a ARL Liberty  ","VIRTUAL ","NACIONAL","2019-05-16","8:30 AM - 10:30A M","Liberty University",200,1]
["ENTRENAMIENTOS PÁGINA WEB","Capacitación Web Masiva empresas activas","Empresas afiliadas a ARL Liberty  ","VIRTUAL ","NACIONAL","2019-08-15","8:30 AM - 10:30A M","Liberty University",200,1]
["ESTILOS DE VIDA Y TRABAJO SALUDABLE","Importancia del programa de  estilos de vida y trabajo saludable y relación con los perfiles epidemiológicos.","Personal afiliado a Liberty Seguros. ","VIRTUAL ","NACIONAL","2019-06-19","2:00 p.m. a 5:00 p.m.","Liberty University",200,1]
["EXCEL EN SGSST","Herramientas de Excel para la formulación de bases de información del sistema de gestión ( validaciones y fórmulas) y tabla dinámica. ","Afiliados a ARL Liberty ","VIRTUAL ","NACIONAL","2019-10-31","Abierto","Liberty University",200,1]
["LEGISLACIÓN SG SST","Actualización legal y normas en evolución  en el SGSST","Los participantes deben estar afiliados a la ARL LIBERTY  y  tener a cargo el Sistema de Gestión de Seguridad y Salud en el Trabajo o pertenecer al área de Recursos Humanos o al área jurídica","VIRTUAL ","NACIONAL","2019-08-15","2:30 - 4:30 PM","Liberty University",200,1]
["LEGISLACIÓN SG SST","Actualización legal y normas en evolución  en el SGSST","Los participantes deben estar afiliados a la ARL LIBERTY  y  tener a cargo el Sistema de Gestión de Seguridad y Salud en el Trabajo o pertenecer al área de Recursos Humanos o al área jurídica","VIRTUAL ","NACIONAL","2019-04-11","2:30 - 4:30 PM","Liberty University",200,1]
["MANEJO SEGURO DE MONTACARGAS","Capacitación en manejo seguro de montacargas","Trabajadores que manejen montacargas dentro de su labor. ","VIRTUAL ","NACIONAL","2018-05-24","2:00 a 4:00 p.m.","Liberty University",200,1]
["MEJOR PREVENIR PARA GANAR","RCP: Reporte de condiciones peligrosas","Responsable del sistema de gestión, copasst y líderes.","VIRTUAL ","NACIONAL","2019-10-31","Abierto ","Liberty University",200,1]
["MEJOR PREVENIR PARA GANAR","MVP: Gerenciando comportamientos vitales","Responsable del sistema de gestión, copasst y líderes.","VIRTUAL ","NACIONAL","2019-10-31","Abierto ","Liberty University",200,1]
["MEJOR PREVENIR PARA GANAR","Dejando Huella: Programa de prevención caídas a nivel ","Responsable del sistema de gestión, copasst y líderes.","VIRTUAL ","NACIONAL","2019-10-31","Abierto ","Liberty University",200,1]
["MEJOR PREVENIR PARA GANAR","Programa Estrella: Programa de orden y aseo.","Responsable del sistema de gestión, copasst y líderes.","VIRTUAL ","NACIONAL","2019-10-31","Abierto ","Liberty University",200,1]
["MEJOR PREVENIR PARA GANAR","Sistemas de Vigilancia Epidemiológica. ","Responsable del sistema de gestión, copasst y líderes.","VIRTUAL ","NACIONAL","2019-10-31","Abierto","Liberty University",200,1]
["MEJOR PREVENIR PARA GANAR","SMD: Sistema de manejo decisivo ","Responsable del sistema de gestión, copasst y líderes.","VIRTUAL ","NACIONAL","2019-10-31","Abierto ","Liberty University",200,1]
["MEJOR PREVENIR PARA GANAR","Manos a la obra:  Programa de prevención de accidentes en manos","Responsable del sistema de gestión, copasst y líderes.","VIRTUAL ","NACIONAL","2019-10-31","Abierto ","Liberty University",200,1]
["MEJOR PREVENIR PARA GANAR","Control de Fuentes de pérdida","Responsable del sistema de gestión, copasst y líderes.","VIRTUAL ","NACIONAL","2019-10-31","Abierto","Liberty University",200,1]
["MEJOR PREVENIR PARA GANAR","O.S.M. Programa Operación Segura de Máquina.   ","Responsable del sistema de gestión, copasst y líderes.","VIRTUAL ","NACIONAL","2019-10-31","Abierto ","Liberty University",200,1]
["MEJOR PREVENIR PARA GANAR","AOSE Arquitectura de la excelencia en la seguridad ","Responsable del sistema de gestión. ","VIRTUAL ","NACIONAL","2019-10-31","Abierto","Liberty University",200,1]
["PELIGRO MECANICO ","Curso Peligro Mecánico ","Personal con exposición a peligro por condición de seguridad dado por riesgo mecánico y responsable del SG-SST ","VIRTUAL ","NACIONAL","2019-10-31","Abierto ","Liberty University",200,1]
["PLAN ESTRATÉGICO DE SEGURIDAD VIAL. PESV","Curso de Seguridad Vial – Embajadores por la seguridad vial.","Los participantes deben estar afiliados a ARL Liberty y tener a cargo el SG-SST","VIRTUAL ","NACIONAL","2019-10-31","Abierto ","Liberty University",200,1]
["PLAN ESTRATÉGICO DE SEGURIDAD VIAL. PESV","Capacitación actores de la vía -  seguridad vial ","Priorizar por el personal que tiene exposición a riesgo vial ","PRESENCIAL ","BARRANCABERMEJA","2019-05-23","8:00 a.m. - 12:00 m","Hotel San Silvestre Cra 19 # 58a–13",2,1]
["PLAN ESTRATÉGICO DE SEGURIDAD VIAL. PESV","Capacitación actores de la vía -  seguridad vial ","Priorizar por el personal que tiene exposición a riesgo vial ","PRESENCIAL ","BARRANQUILLA","2019-10-17","8:00 a.m. - 12:00 m","ICONTEC Cra 57 No. 70-89 Barranquilla",3,1]
["PLAN ESTRATÉGICO DE SEGURIDAD VIAL. PESV","Capacitación actores de la vía -  seguridad vial ","Priorizar por el personal que tiene exposición a riesgo vial ","PRESENCIAL ","BUCARAMANGA","2019-05-30","8:00 a.m. - 12:00 m","Hotel La Triada Cra. 20 #34--22",2,1]
["PLAN ESTRATÉGICO DE SEGURIDAD VIAL. PESV","Capacitación actores de la vía -  seguridad vial ","Priorizar por el personal que tiene exposición a riesgo vial ","PRESENCIAL ","CALI","2019-05-23","8:00 a.m. - 12:00 m","Av. 5 Norte # 38N-81",2,1]
["PLAN ESTRATÉGICO DE SEGURIDAD VIAL. PESV","Capacitación actores de la vía -  seguridad vial ","Priorizar por el personal que tiene exposición a riesgo vial ","PRESENCIAL ","CARTAGENA","2019-05-16","8:00 a.m. - 12:00 m","Liberty Seguros, Calle del Arsenal No 8B-195 piso 1",2,1]
["PLAN ESTRATÉGICO DE SEGURIDAD VIAL. PESV","Capacitación actores de la vía -  seguridad vial ","Priorizar por el personal que tiene exposición a riesgo vial ","PRESENCIAL ","MEDELLÍN ","2019-02-05","8:00 a.m. - 12:00 m","Carrera 43A No 19-17, auditorio piso 4 torre norte Block Empresarial",4,1]
["PLAN ESTRATÉGICO DE SEGURIDAD VIAL. PESV","Plan Estratégico de Seguridad Vial: \nDónde deben estar las empresas en el PESV hoy? \nCambios en la noma.","Personal responsable del sistema de gestión de seguridad y salud en el trabajo y/o cargos que rinden cuentas del SG-SST. ","PRESENCIAL ","BOGOTÁ","2019-11-14","8:00 - 12:00 P.M","Calle 73 N° 10 - 83 Torre C Oficina 302. Salón 302 Fucsia",2,1]
["PROGRAMA DE GESTIÓN RIESGO QUÍMICO","Programa de gestión de riesgo químico y sistema globalmente armonizado ","Personal responsable del sistema de gestión de seguridad y salud en el trabajo y/o personal de compras - producción ","PRESENCIAL ","BARRANCABERMEJA","2019-02-21","8:00 a.m. - 12:00 m","Cra 12 No 49a -18 Barrio Colombia. ",2,1]
["PROGRAMA DE GESTIÓN RIESGO QUÍMICO","Programa de gestión de riesgo químico y sistema globalmente armonizado ","Personal responsable del sistema de gestión de seguridad y salud en el trabajo y/o personal de compras - producción ","PRESENCIAL ","BARRANQUILLA","2019-11-07","8:00 a.m. - 12:00 m","ICONTEC Cra 57 No. 70-89 Barranquilla",3,1]
["PROGRAMA DE GESTIÓN RIESGO QUÍMICO","Programa de gestión de riesgo químico y sistema globalmente armonizado ","Personal responsable del sistema de gestión de seguridad y salud en el trabajo y/o personal de compras - producción ","PRESENCIAL ","BUCARAMANGA","2019-06-06","8:00 a.m. - 12:00 m","Hotel La Triada Cra. 20 #34--22",2,1]
["PROGRAMA DE GESTIÓN RIESGO QUÍMICO","Programa de gestión de riesgo químico y sistema globalmente armonizado ","Personal responsable del sistema de gestión de seguridad y salud en el trabajo y/o personal de compras - producción ","PRESENCIAL ","CALI","2019-02-21","8:00 a.m. - 12:00 m","Av. 5 Norte # 38N-81",2,1]
["PROGRAMA DE GESTIÓN RIESGO QUÍMICO","Programa de gestión de riesgo químico y sistema globalmente armonizado ","Personal responsable del sistema de gestión de seguridad y salud en el trabajo y/o personal de compras - producción ","PRESENCIAL ","BOGOTÁ","2019-02-21","8:00 a.m. - 12:00 m","Calle 73 N° 10 - 83 Torre C Oficina 302. Salón 302 Fucsia",2,1]
["PROGRAMA DE GESTIÓN RIESGO QUÍMICO","Programa de gestión de riesgo químico y sistema globalmente armonizado ","Personal responsable del sistema de gestión de seguridad y salud en el trabajo y/o personal de compras - producción ","PRESENCIAL ","MEDELLÍN ","2019-04-24","8:00 a.m. - 12:00 m","Carrera 43A No 19-17, auditorio piso 4 torre norte Block Empresarial",4,1]
["PROGRAMA DE GESTIÓN RIESGO QUÍMICO","Programa de gestión de riesgo químico y sistema globalmente armonizado ","Personal responsable del sistema de gestión de seguridad y salud en el trabajo y/o personal de compras - producción ","VIRTUAL ","NACIONAL","2019-03-01","2:00 p.m. - 5:00 p.m.","Liberty University",200,1]
["RIESGO PSICOSOCIAL ","Programa de gestión riesgo psicosocial ","Personal responsable del sistema de gestión, Talento humano y comité de convivencia. ","PRESENCIAL ","MEDELLÍN ","2019-06-07","8:00 am - 10:00 a.m.","Carrera 43A No 19-17, auditorio piso 4 torre norte Block Empresarial",4,1]
["RIESGO PSICOSOCIAL ","Programa de gestión riesgo psicosocial (Aula viviendo en armonía).","Personal responsable del sistema de gestión, Talento humano y comité de convivencia. ","VIRTUAL ","NACIONAL","2019-10-31","Abierto","Liberty University",200,1]
["RIESGO PSICOSOCIAL ","Familia saludable, trabajador sano. (Aula viviendo en armonía).","Trabajadores afiliados a Liberty","VIRTUAL ","NACIONAL","2019-10-31","Abierto","Liberty University",200,1]
["RIESGO PSICOSOCIAL ","Manejo de emociones y salud integral","Trabajadores afiliados a Liberty","VIRTUAL ","NACIONAL","2019-10-29","2:30 p.m. - 4:30 p.m.","Liberty University",200,1]
["SISTEMA DE GESTIÓN SEGURIDAD Y SALUD EN EL TRABAJO SST","Curso 50 Horas Sistema de gestión de seguridad y salud en el trabajo ","Responsable del sistema de gestión, copasst y todas los cargos que rinden cuentas en el sistema de gestión de seguridad y salud en el trabajo).","VIRTUAL ","NACIONAL","2019-10-31","Abierto ","Liberty University",200,1]
["SISTEMA DE GESTIÓN SEGURIDAD Y SALUD EN EL TRABAJO SST","Sistema de gestion de seguridad y salud en el trabajo, enfocado hacia el plan de trabajo y fase de verificación del ministerio de trabajo.  ","Responsable del sistema de gestión, copasst y todas los cargos que rinden cuentas en el sistema de gestión de seguridad y salud en el trabajo).","PRESENCIAL ","PEREIRA","2019-03-07","8:00 a.m. - 12:00 m","Previo a la actividad se estará confirmando lugar del evento ",2,1]
["SISTEMA DE GESTIÓN SEGURIDAD Y SALUD EN EL TRABAJO SST","Sistema de gestion de seguridad y salud en el trabajo, enfocado hacia el plan de trabajo y fase de verificación del ministerio de trabajo.  ","Responsable del sistema de gestión, copasst y todas los cargos que rinden cuentas en el sistema de gestión de seguridad y salud en el trabajo).","PRESENCIAL ","TUNJA","2019-03-07","8:00 a.m. - 12:00 m","Previo a la actividad se estará confirmando lugar del evento ",2,1]
["SISTEMA DE GESTIÓN SEGURIDAD Y SALUD EN EL TRABAJO SST","Sistema de gestion de seguridad y salud en el trabajo, enfocado hacia el plan de trabajo y fase de verificación del ministerio de trabajo.  ","Responsable del sistema de gestión, copasst y todas los cargos que rinden cuentas en el sistema de gestión de seguridad y salud en el trabajo).","PRESENCIAL ","VILLAVICENCIO","2019-03-07","8:00 a.m. - 12:00 m","Previo a la actividad se estará confirmando lugar del evento ",2,1]
["SISTEMA DE GESTIÓN SEGURIDAD Y SALUD EN EL TRABAJO SST","Sistema de gestion de seguridad y salud en el trabajo, enfocado hacia el plan de trabajo y fase de verificación del ministerio de trabajo.  ","Responsable del sistema de gestión, copasst y todas los cargos que rinden cuentas en el sistema de gestión de seguridad y salud en el trabajo).","PRESENCIAL ","SOGAMOSO ","2019-03-07","8:00 a.m. - 12:00 m","Previo a la actividad se estará confirmando lugar del evento ",2,1]
["SISTEMA DE GESTIÓN SEGURIDAD Y SALUD EN EL TRABAJO SST","Curso certificado sistema de gestión.  En qué fase está mi empresa con respecto al cumplimiento de las fases dadas por el ministerio?. Modulo 1 . Evaluación estándares mínimos y componentes del SG - SST y Fase Planear. ","Responsable del sistema de gestión, copasst y todas los cargos que rinden cuentas en el sistema de gestión de seguridad y salud en el trabajo).","PRESENCIAL ","BARRANQUILLA","2019-03-28","8:00 a.m. - 12:00 m","Liberty Seguros Calle 77 No 59-35 Barranquilla",3,1]
["SISTEMA DE GESTIÓN SEGURIDAD Y SALUD EN EL TRABAJO SST","Curso certificado sistema de gestión.  En qué fase está mi empresa con respecto al cumplimiento de las fases dadas por el ministerio?. Modulo 1 . Evaluación estándares mínimos y componentes del SG - SST y Fase Planear. ","Responsable del sistema de gestión, copasst y todas los cargos que rinden cuentas en el sistema de gestión de seguridad y salud en el trabajo).","PRESENCIAL ","BUCARAMANGA","2019-02-21","8:00 a.m. - 12:00 m","Hotel La Triada Cra. 20 #34--22",2,1]
["SISTEMA DE GESTIÓN SEGURIDAD Y SALUD EN EL TRABAJO SST","Curso certificado sistema de gestión.  En qué fase está mi empresa con respecto al cumplimiento de las fases dadas por el ministerio?. Modulo 1 . Evaluación estándares mínimos y componentes del SG - SST y Fase Planear. ","Responsable del sistema de gestión, copasst y todas los cargos que rinden cuentas en el sistema de gestión de seguridad y salud en el trabajo).","PRESENCIAL ","CALI","2019-03-20","8:00 a.m. - 12:00 m","Av. 5 Norte # 38N-81",2,1]
["SISTEMA DE GESTIÓN SEGURIDAD Y SALUD EN EL TRABAJO SST","Curso certificado sistema de gestión.  En qué fase está mi empresa con respecto al cumplimiento de las fases dadas por el ministerio?. Modulo 1 . Evaluación estándares mínimos y componentes del SG - SST y Fase Planear. ","Responsable del sistema de gestión, copasst y todas los cargos que rinden cuentas en el sistema de gestión de seguridad y salud en el trabajo).","PRESENCIAL ","CARTAGENA","2019-02-07","8:00 a.m. - 12:00 m","Liberty Seguros, Calle del Arsenal No 8B-195 piso 1",2,1]
["SISTEMA DE GESTIÓN SEGURIDAD Y SALUD EN EL TRABAJO SST","Curso certificado sistema de gestión.  En qué fase está mi empresa con respecto al cumplimiento de las fases dadas por el ministerio?. Modulo 1 . Evaluación estándares mínimos y componentes del SG - SST y Fase Planear. ","Responsable del sistema de gestión, copasst y todas los cargos que rinden cuentas en el sistema de gestión de seguridad y salud en el trabajo).","PRESENCIAL ","BOGOTÁ","2019-02-07","8:00 a.m. - 12:00 m","Calle 73 N° 10 - 83 Torre C Oficina 302. Salón 302 Fucsia",2,1]
["SISTEMA DE GESTIÓN SEGURIDAD Y SALUD EN EL TRABAJO SST","Curso certificado sistema de gestión.  En qué fase está mi empresa con respecto al cumplimiento de las fases dadas por el ministerio?. Modulo 1 . Evaluación estándares mínimos y componentes del SG - SST y Fase Planear. ","Responsable del sistema de gestión, copasst y todas los cargos que rinden cuentas en el sistema de gestión de seguridad y salud en el trabajo).","PRESENCIAL ","BOGOTÁ","2019-07-04","8:00 a.m. - 12:00 m","Calle 73 N° 10 - 83 Torre C Oficina 302. Salón 302 Fucsia",2,1]
["SISTEMA DE GESTIÓN SEGURIDAD Y SALUD EN EL TRABAJO SST","Curso certificado sistema de gestión.  En qué fase está mi empresa con respecto al cumplimiento de las fases dadas por el ministerio?. Modulo 1 . Evaluación estándares mínimos y componentes del SG - SST y Fase Planear. ","Responsable del sistema de gestión, copasst y todas los cargos que rinden cuentas en el sistema de gestión de seguridad y salud en el trabajo).","PRESENCIAL ","MEDELLÍN ","2019-03-06","8:00 a.m. - 12:00 m","Carrera 43A No 19-17, auditorio piso 4 torre norte Block Empresarial",4,1]
["SISTEMA DE GESTIÓN SEGURIDAD Y SALUD EN EL TRABAJO SST","Curso certificado sistema de gestión.  En qué fase está mi empresa con respecto al cumplimiento de las fases dadas por el ministerio?. Modulo 2 . Fase Hacer y  Verificar. Requisito módulo 1.","Responsable del sistema de gestión, copasst y todas los cargos que rinden cuentas en el sistema de gestión de seguridad y salud en el trabajo).","PRESENCIAL ","BARRANQUILLA","2019-04-11","8:00 a.m. - 12:00 m","ICONTEC Cra 57 No. 70-89 Barranquilla",3,1]
["SISTEMA DE GESTIÓN SEGURIDAD Y SALUD EN EL TRABAJO SST","Curso certificado sistema de gestión.  En qué fase está mi empresa con respecto al cumplimiento de las fases dadas por el ministerio?. Modulo 2 . Fase Hacer y  Verificar. Requisito módulo 1.","Responsable del sistema de gestión, copasst y todas los cargos que rinden cuentas en el sistema de gestión de seguridad y salud en el trabajo).","PRESENCIAL ","BUCARAMANGA","2019-03-14","8:00 a.m. - 12:00 m","Hotel La Triada Cra. 20 #34--22",2,1]
["SISTEMA DE GESTIÓN SEGURIDAD Y SALUD EN EL TRABAJO SST","Curso certificado sistema de gestión.  En qué fase está mi empresa con respecto al cumplimiento de las fases dadas por el ministerio?. Modulo 2 . Fase Hacer y  Verificar. Requisito módulo 1.","Responsable del sistema de gestión, copasst y todas los cargos que rinden cuentas en el sistema de gestión de seguridad y salud en el trabajo).","PRESENCIAL ","CALI","2019-03-28","8:00 a.m. - 12:00 m","Av. 5 Norte # 38N-81",2,1]
["SISTEMA DE GESTIÓN SEGURIDAD Y SALUD EN EL TRABAJO SST","Curso certificado sistema de gestión.  En qué fase está mi empresa con respecto al cumplimiento de las fases dadas por el ministerio?. Modulo 2 . Fase Hacer y  Verificar. Requisito módulo 1.","Responsable del sistema de gestión, copasst y todas los cargos que rinden cuentas en el sistema de gestión de seguridad y salud en el trabajo).","PRESENCIAL ","CARTAGENA","2019-03-14","8:00 a.m. - 12:00 m","Liberty Seguros, Calle del Arsenal No 8B-195 piso 1",2,1]
["SISTEMA DE GESTIÓN SEGURIDAD Y SALUD EN EL TRABAJO SST","Curso certificado sistema de gestión.  En qué fase está mi empresa con respecto al cumplimiento de las fases dadas por el ministerio?. Modulo 2 . Fase Hacer y  Verificar. Requisito módulo 1.","Responsable del sistema de gestión, copasst y todas los cargos que rinden cuentas en el sistema de gestión de seguridad y salud en el trabajo).","PRESENCIAL ","BOGOTÁ","2019-08-08","8:00 a.m. - 12:00 m","Calle 73 N° 10 - 83 Torre C Oficina 302. Salón 302 Fucsia",2,1]
["SISTEMA DE GESTIÓN SEGURIDAD Y SALUD EN EL TRABAJO SST","Curso certificado sistema de gestión.  En qué fase está mi empresa con respecto al cumplimiento de las fases dadas por el ministerio?. Modulo 2 . Fase Hacer y  Verificar. Requisito módulo 1.","Responsable del sistema de gestión, copasst y todas los cargos que rinden cuentas en el sistema de gestión de seguridad y salud en el trabajo).","PRESENCIAL ","BOGOTÁ","2019-03-14","8:00 a.m. - 12:00 m","Calle 73 N° 10 - 83 Torre C Oficina 302. Salón 302 Fucsia",2,1]
["SISTEMA DE GESTIÓN SEGURIDAD Y SALUD EN EL TRABAJO SST","Curso certificado sistema de gestión.  En qué fase está mi empresa con respecto al cumplimiento de las fases dadas por el ministerio?. Modulo 2 . Fase Hacer y  Verificar. Requisito módulo 1.","Responsable del sistema de gestión, copasst y todas los cargos que rinden cuentas en el sistema de gestión de seguridad y salud en el trabajo).","PRESENCIAL ","MEDELLÍN ","2019-05-08","8:00 a.m. - 12:00 m","Carrera 43A No 19-17, auditorio piso 4 torre norte Block Empresarial",4,1]
["SISTEMA DE GESTIÓN SEGURIDAD Y SALUD EN EL TRABAJO SST","Curso certificado sistema de gestión.  Fases estándares mínimos. En qué fase está mi empresa con respecto al cumplimiento de las fases dadas por el ministerio?. Modulo 3. Fase Actuar y seguimiento plan de mejora.  Requisito modulo 1 y 2.","Responsable del sistema de gestión, copasst y todas los cargos que rinden cuentas en el sistema de gestión de seguridad y salud en el trabajo).","PRESENCIAL ","BARRANQUILLA","2019-04-25","8:00 a.m. - 12:00 m","ICONTEC Cra 57 No. 70-89 Barranquilla",3,1]
["SISTEMA DE GESTIÓN SEGURIDAD Y SALUD EN EL TRABAJO SST","Curso certificado sistema de gestión.  Fases estándares mínimos. En qué fase está mi empresa con respecto al cumplimiento de las fases dadas por el ministerio?. Modulo 3. Fase Actuar y seguimiento plan de mejora.  Requisito modulo 1 y 2.","Responsable del sistema de gestión, copasst y todas los cargos que rinden cuentas en el sistema de gestión de seguridad y salud en el trabajo).","PRESENCIAL ","BUCARAMANGA","2019-04-24","8:00 a.m. - 12:00 m","Hotel La Triada Cra. 20 #34--22",2,1]
["SISTEMA DE GESTIÓN SEGURIDAD Y SALUD EN EL TRABAJO SST","Curso certificado sistema de gestión.  Fases estándares mínimos. En qué fase está mi empresa con respecto al cumplimiento de las fases dadas por el ministerio?. Modulo 3. Fase Actuar y seguimiento plan de mejora.  Requisito modulo 1 y 2.","Responsable del sistema de gestión, copasst y todas los cargos que rinden cuentas en el sistema de gestión de seguridad y salud en el trabajo).","PRESENCIAL ","CALI","2019-04-25","8:00 a.m. - 12:00 m","Av. 5 Norte # 38N-81",2,1]
["SISTEMA DE GESTIÓN SEGURIDAD Y SALUD EN EL TRABAJO SST","Curso certificado sistema de gestión.  Fases estándares mínimos. En qué fase está mi empresa con respecto al cumplimiento de las fases dadas por el ministerio?. Modulo 3. Fase Actuar y seguimiento plan de mejora.  Requisito modulo 1 y 2.","Responsable del sistema de gestión, copasst y todas los cargos que rinden cuentas en el sistema de gestión de seguridad y salud en el trabajo).","PRESENCIAL ","CARTAGENA","2019-04-25","8:00 a.m. - 12:00 m","Liberty Seguros, Calle del Arsenal No 8B-195 piso 1",2,1]
["SISTEMA DE GESTIÓN SEGURIDAD Y SALUD EN EL TRABAJO SST","Curso certificado sistema de gestión.  Fases estándares mínimos. En qué fase está mi empresa con respecto al cumplimiento de las fases dadas por el ministerio?. Modulo 3. Fase Actuar y seguimiento plan de mejora.  Requisito modulo 1 y 2.","Responsable del sistema de gestión, copasst y todas los cargos que rinden cuentas en el sistema de gestión de seguridad y salud en el trabajo).","PRESENCIAL ","BOGOTÁ","2019-09-12","8:00 a.m. - 12:00 m","Calle 73 N° 10 - 83 Torre C Oficina 302. Salón 302 Fucsia",2,1]
["SISTEMA DE GESTIÓN SEGURIDAD Y SALUD EN EL TRABAJO SST","Curso certificado sistema de gestión.  Fases estándares mínimos. En qué fase está mi empresa con respecto al cumplimiento de las fases dadas por el ministerio?. Modulo 3. Fase Actuar y seguimiento plan de mejora.  Requisito modulo 1 y 2.","Responsable del sistema de gestión, copasst y todas los cargos que rinden cuentas en el sistema de gestión de seguridad y salud en el trabajo).","PRESENCIAL ","BOGOTÁ","2019-04-25","8:00 a.m. - 12:00 m","Calle 73 N° 10 - 83 Torre C Oficina 302. Salón 302 Fucsia",2,1]
["SISTEMA DE GESTIÓN SEGURIDAD Y SALUD EN EL TRABAJO SST","Curso certificado sistema de gestión.  Fases estándares mínimos. En qué fase está mi empresa con respecto al cumplimiento de las fases dadas por el ministerio?. Modulo 3. Fase Actuar y seguimiento plan de mejora.  Requisito modulo 1 y 2.","Responsable del sistema de gestión, copasst y todas los cargos que rinden cuentas en el sistema de gestión de seguridad y salud en el trabajo).","PRESENCIAL ","MEDELLÍN ","2019-06-18","8:00 a.m. - 12:00 m","Carrera 43A No 19-17, auditorio piso 4 torre norte Block Empresarial",4,1]
["SISTEMA DE GESTIÓN SEGURIDAD Y SALUD EN EL TRABAJO SST","Curso certificado sistema de gestión.  Fases estándares mínimos. En qué fase está mi empresa con respecto al cumplimiento de las fases dadas por el ministerio?. Modulo 4: Inspección, vigilancia y control.   Fase de verificación Ministerio de trabajo. Requisito módulo 1, 2 y 3","Responsable del sistema de gestión, copasst y todas los cargos que rinden cuentas en el sistema de gestión de seguridad y salud en el trabajo).","PRESENCIAL ","BUCARAMANGA","2019-05-08","8:00 a.m. - 12:00 m","Hotel La Triada Cra. 20 #34--22",2,1]
["SISTEMA DE GESTIÓN SEGURIDAD Y SALUD EN EL TRABAJO SST","Curso certificado sistema de gestión.  Fases estándares mínimos. En qué fase está mi empresa con respecto al cumplimiento de las fases dadas por el ministerio?. Modulo 4: Inspección, vigilancia y control.   Fase de verificación Ministerio de trabajo. Requisito módulo 1, 2 y 3","Responsable del sistema de gestión, copasst y todas los cargos que rinden cuentas en el sistema de gestión de seguridad y salud en el trabajo).","PRESENCIAL ","CALI","2019-05-09","8:00 a.m. - 12:00 m","Av. 5 Norte # 38N-81",2,1]
["SISTEMA DE GESTIÓN SEGURIDAD Y SALUD EN EL TRABAJO SST","Curso certificado sistema de gestión.  Fases estándares mínimos. En qué fase está mi empresa con respecto al cumplimiento de las fases dadas por el ministerio?. Modulo 4: Inspección, vigilancia y control.   Fase de verificación Ministerio de trabajo. Requisito módulo 1, 2 y 3","Responsable del sistema de gestión, copasst y todas los cargos que rinden cuentas en el sistema de gestión de seguridad y salud en el trabajo).","PRESENCIAL ","CARTAGENA","2019-05-09","8:00 a.m. - 12:00 m","Liberty Seguros, Calle del Arsenal No 8B-195 piso 1",2,1]
["SISTEMA DE GESTIÓN SEGURIDAD Y SALUD EN EL TRABAJO SST","Curso certificado sistema de gestión.  Fases estándares mínimos. En qué fase está mi empresa con respecto al cumplimiento de las fases dadas por el ministerio?. Modulo 4: Inspección, vigilancia y control.   Fase de verificación Ministerio de trabajo. Requisito módulo 1, 2 y 3","Responsable del sistema de gestión, copasst y todas los cargos que rinden cuentas en el sistema de gestión de seguridad y salud en el trabajo).","PRESENCIAL ","BOGOTÁ","2019-05-09","8:00 a.m. - 12:00 m","Calle 73 N° 10 - 83 Torre C Oficina 302. Salón 302 Fucsia",2,1]
["SISTEMA DE GESTIÓN SEGURIDAD Y SALUD EN EL TRABAJO SST","Curso certificado sistema de gestión.  Fases estándares mínimos. En qué fase está mi empresa con respecto al cumplimiento de las fases dadas por el ministerio?. Modulo 4: Inspección, vigilancia y control.   Fase de verificación Ministerio de trabajo. Requisito módulo 1, 2 y 3","Responsable del sistema de gestión, copasst y todas los cargos que rinden cuentas en el sistema de gestión de seguridad y salud en el trabajo).","PRESENCIAL ","MEDELLÍN ","2019-08-14","8:00 a.m. - 12:00 m","Carrera 43A No 19-17, auditorio piso 4 torre norte Block Empresarial",4,1]
["SISTEMA DE GESTIÓN SEGURIDAD Y SALUD EN EL TRABAJO SST","SG SST.  Curso de auditoria SG SST","Responsable del sistema de gestión, copasst y todas los cargos que rinden cuentas en el sistema de gestión de seguridad y salud en el trabajo).","PRESENCIAL ","BARRANCABERMEJA","2019-05-30","8:00 a.m. - 12:00 m","Hotel San Silvestre Cra 19 # 58a–13",2,1]
["SISTEMA DE GESTIÓN SEGURIDAD Y SALUD EN EL TRABAJO SST","SG SST.  Curso de auditoria SG SST","Responsable del sistema de gestión, copasst y todas los cargos que rinden cuentas en el sistema de gestión de seguridad y salud en el trabajo).","VIRTUAL ","NACIONAL","2019-05-10","2:00 p.m. a 5:00 p.m.","Liberty University",200,1]
["SISTEMA DE GESTIÓN SEGURIDAD Y SALUD EN EL TRABAJO SST","Actualización legal en SGSST","Responsable del sistema de gestión, copasst y todas los cargos que rinden cuentas en el sistema de gestión de seguridad y salud en el trabajo).","PRESENCIAL ","PEREIRA","2019-08-15","8:00 a.m. - 12:00 m","Previo a la actividad se estará confirmando lugar del evento ",2,1]
["SISTEMA DE GESTIÓN SEGURIDAD Y SALUD EN EL TRABAJO SST","Actualización legal en SGSST","Responsable del sistema de gestión, copasst y todas los cargos que rinden cuentas en el sistema de gestión de seguridad y salud en el trabajo).","PRESENCIAL ","TUNJA","2019-08-15","8:00 a.m. - 12:00 m","Previo a la actividad se estará confirmando lugar del evento ",2,1]
["SISTEMA DE GESTIÓN SEGURIDAD Y SALUD EN EL TRABAJO SST","Actualización legal en SGSST","Responsable del sistema de gestión, copasst y todas los cargos que rinden cuentas en el sistema de gestión de seguridad y salud en el trabajo).","PRESENCIAL ","VILLAVICENCIO","2019-08-15","8:00 a.m. - 12:00 m","Previo a la actividad se estará confirmando lugar del evento ",2,1]
["SISTEMA DE GESTIÓN SEGURIDAD Y SALUD EN EL TRABAJO SST","Actualización legal en SGSST","Responsable del sistema de gestión, copasst y todas los cargos que rinden cuentas en el sistema de gestión de seguridad y salud en el trabajo).","PRESENCIAL ","SOGAMOSO ","2019-08-15","8:00 a.m. - 12:00 m","Previo a la actividad se estará confirmando lugar del evento ",2,1]
["SISTEMA DE GESTIÓN SEGURIDAD Y SALUD EN EL TRABAJO SST","Resolución 0312 de 2019 Estándares Mínimos del Sistema de Gestión de Seguridad y Salud en el Trabajo.","Responsable del sistema de gestión, copasst y todas los cargos que rinden cuentas en el sistema de gestión de seguridad y salud en el trabajo).","VIRTUAL ","NACIONAL","2019-03-27","2:00 p.m. 4:00 p.m.","Liberty University",200,1]
["SISTEMA DE GESTIÓN SEGURIDAD Y SALUD EN EL TRABAJO SST","Resolución 0312 de 2019 Estándares Mínimos del Sistema de Gestión de Seguridad y Salud en el Trabajo.","Responsable del sistema de gestión, copasst y todas los cargos que rinden cuentas en el sistema de gestión de seguridad y salud en el trabajo.","VIRTUAL ","NACIONAL","2019-03-27","2:00 a 5:00 p.m.","Liberty University",2,1]
["SISTEMA DE GESTIÓN SEGURIDAD Y SALUD EN EL TRABAJO SST","Curso certificado sistema de gestión.  Fases estándares mínimos. En qué fase está mi empresa con respecto al cumplimiento de las fases dadas por el ministerio?. Modulo 4: Inspección, vigilancia y control.   Fase de verificación Ministerio de trabajo. ","Responsable del sistema de gestión, copasst y todas los cargos que rinden cuentas en el sistema de gestión de seguridad y salud en el trabajo).","PRESENCIAL ","BARRANQUILLA","2019-05-09","8:00 a.m. - 12:00 m","ICONTEC Cra 57 No. 70-89 Barranquilla",3,1]
["SISTEMA DE GESTIÓN SEGURIDAD Y SALUD EN EL TRABAJO SST","Curso certificado sistema de gestión.  Fases estándares mínimos. En qué fase está mi empresa con respecto al cumplimiento de las fases dadas por el ministerio?. Modulo 4: Inspección, vigilancia y control.  ","Responsable del sistema de gestión, copasst y todas los cargos que rinden cuentas en el sistema de gestión de seguridad y salud en el trabajo).","PRESENCIAL ","BOGOTÁ","2019-10-10","8:00 a.m. - 12:00 m","Calle 73 N° 10 - 83 Torre C Oficina 302. Salón 302 Fucsia",2,1]
["TAREAS DE ALTO RIESGO ","Curso tareas de alto riesgo. Módulo 1: Seguridad eléctrica  ","Personal responsable del sistema de gestión, líderes de proceso, copasst. ","PRESENCIAL ","BARRANCABERMEJA","2019-07-11","8:00 a.m. - 12:00 m","Hotel San Silvestre Cra 19 # 58a–13",2,1]
["TAREAS DE ALTO RIESGO ","Curso tareas de alto riesgo. Módulo 1: Seguridad eléctrica  ","Personal responsable del sistema de gestión, líderes de proceso, copasst. ","PRESENCIAL ","BARRANQUILLA","2019-06-20","8:00 a.m. - 12:00 m","ICONTEC Cra 57 No. 70-89 Barranquilla",3,1]
["TAREAS DE ALTO RIESGO ","Curso tareas de alto riesgo. Módulo 1: Seguridad eléctrica  ","Personal responsable del sistema de gestión, líderes de proceso, copasst. ","PRESENCIAL ","BUCARAMANGA","2019-07-11","8:00 a.m. - 12:00 m","Hotel La Triada Cra. 20 # 34—22",2,1]
["TAREAS DE ALTO RIESGO ","Curso tareas de alto riesgo. Módulo 1: Seguridad eléctrica  ","Personal responsable del sistema de gestión, líderes de proceso, copasst. ","PRESENCIAL ","CALI","2019-07-11","8:00 a.m. - 12:00 m","Av. 5 Norte # 38N-81",2,1]
["TAREAS DE ALTO RIESGO ","Curso tareas de alto riesgo. Módulo 1: Seguridad eléctrica  ","Personal responsable del sistema de gestión, líderes de proceso, copasst. ","PRESENCIAL ","CARTAGENA","2019-07-11","8:00 a.m. - 12:00 m","Liberty Seguros, Calle del Arsenal No 8B-195 piso 1",2,1]
["TAREAS DE ALTO RIESGO ","Curso tareas de alto riesgo. Módulo 1: Seguridad eléctrica  ","Personal responsable del sistema de gestión, líderes de proceso, copasst. ","PRESENCIAL ","BOGOTÁ","2019-07-11","8:00 a.m. - 12:00 m","Calle 73 N° 10 - 83 Torre C Oficina 302. Salón 302 Fucsia",2,1]
["TAREAS DE ALTO RIESGO ","Curso tareas de alto riesgo. Módulo 1: Seguridad eléctrica  ","Personal responsable del sistema de gestión, líderes de proceso, copasst. ","PRESENCIAL ","MEDELLÍN ","2019-03-19","8:00 a.m. - 12:00 m","Carrera 43A No 19-17, auditorio piso 4 torre norte Block Empresarial",4,1]
["TAREAS DE ALTO RIESGO ","Creación UVAE Ministerio de trabajo ","Personal responsable del sistema de gestión, líderes de proceso, copasst. ","VIRTUAL ","NACIONAL","2019-08-01","2:00 p.m. - 5:00 p.m.","Liberty University",200,1]
["TAREAS DE ALTO RIESGO ","Curso tareas de alto riesgo. Módulo 2: Operación segura de maquinaria ","Personal responsable del sistema de gestión, líderes de proceso, copasst. ","PRESENCIAL ","BARRANCABERMEJA","2019-08-15","8:00 a.m. - 12:00 m","Hotel San Silvestre Cra 19 # 58a–13",2,1]
["TAREAS DE ALTO RIESGO ","Curso tareas de alto riesgo. Módulo 2: Operación segura de maquinaria ","Personal responsable del sistema de gestión, líderes de proceso, copasst. ","PRESENCIAL ","BARRANQUILLA","2019-07-04","8:00 a.m. - 12:00 m","ICONTEC Cra 57 No. 70-89 Barranquilla",3,1]
["TAREAS DE ALTO RIESGO ","Curso tareas de alto riesgo. Módulo 2: Operación segura de maquinaria ","Personal responsable del sistema de gestión, líderes de proceso, copasst. ","PRESENCIAL ","BUCARAMANGA","2019-08-15","8:00 a.m. - 12:00 m","Hotel La Triada Cra. 20 # 34—22",2,1]
["TAREAS DE ALTO RIESGO ","Curso tareas de alto riesgo. Módulo 2: Operación segura de maquinaria ","Personal responsable del sistema de gestión, líderes de proceso, copasst. ","PRESENCIAL ","CALI","2019-08-16","8:00 a.m. - 12:00 m","Av. 5 Norte # 38N-81",2,1]
["TAREAS DE ALTO RIESGO ","Curso tareas de alto riesgo. Módulo 2: Operación segura de maquinaria ","Personal responsable del sistema de gestión, líderes de proceso, copasst. ","PRESENCIAL ","CARTAGENA","2019-08-15","8:00 a.m. - 12:00 m","Liberty Seguros, Calle del Arsenal No 8B-195 piso 1",2,1]
["TAREAS DE ALTO RIESGO ","Curso tareas de alto riesgo. Módulo 2: Operación segura de maquinaria ","Personal responsable del sistema de gestión, líderes de proceso, copasst. ","PRESENCIAL ","BOGOTÁ","2019-08-15","8:00 a.m. - 12:00 m","Calle 73 N° 10 - 83 Torre C Oficina 302. Salón 302 Fucsia",2,1]
["TAREAS DE ALTO RIESGO ","Curso tareas de alto riesgo. Módulo 2: Operación segura de maquinaria ","Personal responsable del sistema de gestión, líderes de proceso, copasst. ","PRESENCIAL ","MEDELLÍN ","2019-07-16","8:00 a.m. - 12:00 m","Carrera 43A No 19-17, auditorio piso 4 torre norte Block Empresarial",4,1]
["TAREAS DE ALTO RIESGO ","Curso tareas de alto riesgo. Módulo 3: Espacio confinado y atmósferas peligrosas.   Seguridad en excavaciones.  ","Personal responsable del sistema de gestión, líderes de proceso, copasst. ","PRESENCIAL ","BARRANCABERMEJA","2019-09-12","8:00 a.m. - 12:00 m","Hotel San Silvestre Cra 19 # 58a–13",2,1]
["TAREAS DE ALTO RIESGO ","Curso tareas de alto riesgo. Módulo 3: Espacio confinado y atmósferas peligrosas.   Seguridad en excavaciones.  ","Personal responsable del sistema de gestión, líderes de proceso, copasst. ","PRESENCIAL ","BARRANQUILLA","2019-07-18","8:00 a.m. - 12:00 m","ICONTEC Cra 57 No. 70-89 Barranquilla",3,1]
["TAREAS DE ALTO RIESGO ","Curso tareas de alto riesgo. Módulo 3: Espacio confinado y atmósferas peligrosas.   Seguridad en excavaciones.  ","Personal responsable del sistema de gestión, líderes de proceso, copasst. ","PRESENCIAL ","BUCARAMANGA","2019-09-12","8:00 a.m. - 12:00 m","Hotel La Triada Cra. 20 # 34—22",2,1]
["TAREAS DE ALTO RIESGO ","Curso tareas de alto riesgo. Módulo 3: Espacio confinado y atmósferas peligrosas.   Seguridad en excavaciones.  ","Personal responsable del sistema de gestión, líderes de proceso, copasst. ","PRESENCIAL ","CALI","2019-09-13","8:00 a.m. - 12:00 m","Av. 5 Norte # 38N-81",2,1]
["TAREAS DE ALTO RIESGO ","Curso tareas de alto riesgo. Módulo 3: Espacio confinado y atmósferas peligrosas.   Seguridad en excavaciones.  ","Personal responsable del sistema de gestión, líderes de proceso, copasst. ","PRESENCIAL ","CARTAGENA","2019-09-16","8:00 a.m. - 12:00 m","Liberty Seguros, Calle del Arsenal No 8B-195 piso 1",2,1]
["TAREAS DE ALTO RIESGO ","Curso tareas de alto riesgo. Módulo 3: Espacio confinado y atmósferas peligrosas.   Seguridad en excavaciones.  ","Personal responsable del sistema de gestión, líderes de proceso, copasst. ","PRESENCIAL ","BOGOTÁ","2019-09-26","8:00 a.m. - 12:00 m","Calle 73 N° 10 - 83 Torre C Oficina 302. Salón 302 Fucsia",2,1]
["TAREAS DE ALTO RIESGO ","Curso tareas de alto riesgo. Módulo 3: Espacio confinado y atmósferas peligrosas.   Seguridad en excavaciones.  ","Personal responsable del sistema de gestión, líderes de proceso, copasst. ","PRESENCIAL ","MEDELLÍN ","2019-09-04","8:00 a.m. - 12:00 m","Carrera 43A No 19-17, auditorio piso 4 torre norte Block Empresarial",4,1]
["TAREAS DE ALTO RIESGO ","Curso tareas de alto riesgo. Módulo 4: Elaboración de procedimientos seguros, Análisis de tareas seguras y permisos de trabajo. ","Personal responsable del sistema de gestión, líderes de proceso, copasst. ","PRESENCIAL ","BARRANCABERMEJA","2019-11-07","8:00 a.m. - 12:00 m","Hotel San Silvestre Cra 19 # 58a–13",2,1]
["TAREAS DE ALTO RIESGO ","Curso tareas de alto riesgo. Módulo 4: Elaboración de procedimientos seguros, Análisis de tareas seguras y permisos de trabajo. ","Personal responsable del sistema de gestión, líderes de proceso, copasst. ","PRESENCIAL ","BARRANQUILLA","2019-08-01","8:00 a.m. - 12:00 m","ICONTEC Cra 57 No. 70-89 Barranquilla",3,1]
["TAREAS DE ALTO RIESGO ","Curso tareas de alto riesgo. Módulo 4: Elaboración de procedimientos seguros, Análisis de tareas seguras y permisos de trabajo. ","Personal responsable del sistema de gestión, líderes de proceso, copasst. ","PRESENCIAL ","BUCARAMANGA","2019-11-07","8:00 a.m. - 12:00 m","Hotel La Triada Cra. 20 #34--22",2,1]
["TAREAS DE ALTO RIESGO ","Curso tareas de alto riesgo. Módulo 4: Elaboración de procedimientos seguros, Análisis de tareas seguras y permisos de trabajo. ","Personal responsable del sistema de gestión, líderes de proceso, copasst. ","PRESENCIAL ","CALI","2019-11-21","8:00 a.m. - 12:00 m","Av. 5 Norte # 38N-81",2,1]
["TAREAS DE ALTO RIESGO ","Curso tareas de alto riesgo. Módulo 4: Elaboración de procedimientos seguros, Análisis de tareas seguras y permisos de trabajo. ","Personal responsable del sistema de gestión, líderes de proceso, copasst. ","PRESENCIAL ","CARTAGENA","2019-11-06","8:00 a.m. - 12:00 m","Liberty Seguros, Calle del Arsenal No 8B-195 piso 1",2,1]
["TAREAS DE ALTO RIESGO ","Curso tareas de alto riesgo. Módulo 4: Elaboración de procedimientos seguros, Análisis de tareas seguras y permisos de trabajo. ","Personal responsable del sistema de gestión, líderes de proceso, copasst. ","PRESENCIAL ","BOGOTÁ","2019-11-08","8:00 a.m. - 12:00 m","Calle 73 N° 10 - 83 Torre C Oficina 302. Salón 302 Fucsia",2,1]
["TAREAS DE ALTO RIESGO ","Curso tareas de alto riesgo. Módulo 4: Elaboración de procedimientos seguros, Análisis de tareas seguras y permisos de trabajo. ","Personal responsable del sistema de gestión, líderes de proceso, copasst. ","PRESENCIAL ","MEDELLÍN ","2019-10-24","8:00 a.m. - 12:00 m","Carrera 43A No 19-17, auditorio piso 4 torre norte Block Empresarial",4,1]
["TRABAJO EN ALTURA ","Entrenamiento para trabajos en alturas -  (Reentrenamiento)","Personal con exposición a peligro por condición de seguridad, trabajo en alturas","PRESENCIAL ","BOGOTÁ","2019-02-01","8:00 am - 5:00 pm\n20 HORAS\n","Sede Complejo Cazuca – Autopista sur Carrera 4ª N° 53 – 54","(en blanco)",1]
["TRABAJO EN ALTURA ","Entrenamiento para trabajos en alturas -  (Reentrenamiento)","Personal con exposición a peligro por condición de seguridad, trabajo en alturas","PRESENCIAL ","BOGOTÁ","2019-01-01","8:00 am - 5:00 pm\n20 HORAS\n","Sede Complejo Cazuca – Autopista sur Carrera 4ª N° 53 – 54","(en blanco)",1]
["TRABAJO EN ALTURA ","Entrenamiento para trabajos en alturas -  (Reentrenamiento)","Personal con exposición a peligro por condición de seguridad, trabajo en alturas","PRESENCIAL ","BOGOTÁ","2019-03-01","8:00 am - 5:00 pm\n20 HORAS\n","Sede Complejo Cazuca – Autopista sur Carrera 4ª N° 53 – 54","(en blanco)",1]
["TRABAJO EN ALTURA ","Entrenamiento para trabajos en alturas -  (Reentrenamiento)","Personal con exposición a peligro por condición de seguridad, trabajo en alturas","PRESENCIAL ","BOGOTÁ","2019-04-01","8:00 am - 5:00 pm\n20 HORAS\n","Sede Complejo Cazuca – Autopista sur Carrera 4ª N° 53 – 54","(en blanco)",1]
["TRABAJO EN ALTURA ","Entrenamiento para trabajos en alturas -  (Reentrenamiento)","Personal con exposición a peligro por condición de seguridad, trabajo en alturas","PRESENCIAL ","BOGOTÁ","2019-05-01","8:00 am - 5:00 pm\n20 HORAS\n","Sede Complejo Cazuca – Autopista sur Carrera 4ª N° 53 – 54","(en blanco)",1]
["TRABAJO EN ALTURA ","Entrenamiento para trabajos en alturas -  (Reentrenamiento)","Personal con exposición a peligro por condición de seguridad, trabajo en alturas","PRESENCIAL ","BOGOTÁ","2019-06-01","8:00 am - 5:00 pm\n20 HORAS\n","Sede Complejo Cazuca – Autopista sur Carrera 4ª N° 53 – 54","(en blanco)",1]
["TRABAJO EN ALTURA ","Entrenamiento para trabajos en alturas -  (Reentrenamiento)","Personal con exposición a peligro por condición de seguridad, trabajo en alturas","PRESENCIAL ","BOGOTÁ","2019-07-01","8:00 am - 5:00 pm\n20 HORAS\n","Sede Complejo Cazuca – Autopista sur Carrera 4ª N° 53 – 54","(en blanco)",1]
["TRABAJO EN ALTURA ","Entrenamiento para trabajos en alturas -  (Reentrenamiento)","Personal con exposición a peligro por condición de seguridad, trabajo en alturas","PRESENCIAL ","BOGOTÁ","2019-08-01","8:00 am - 5:00 pm\n20 HORAS\n","Sede Complejo Cazuca – Autopista sur Carrera 4ª N° 53 – 54","(en blanco)",1]
["TRABAJO EN ALTURA ","Entrenamiento para trabajos en alturas -  (Reentrenamiento)","Personal con exposición a peligro por condición de seguridad, trabajo en alturas","PRESENCIAL ","BOGOTÁ","2018-09-01","8:00 am - 5:00 pm\n20 HORAS\n","Sede Complejo Cazuca – Autopista sur Carrera 4ª N° 53 – 54","(en blanco)",1]
["TRABAJO EN ALTURA ","Entrenamiento para trabajos en alturas -  (Reentrenamiento)","Personal con exposición a peligro por condición de seguridad, trabajo en alturas","PRESENCIAL ","BOGOTÁ","2019-10-01","8:00 am - 5:00 pm\n20 HORAS\n","Sede Complejo Cazuca – Autopista sur Carrera 4ª N° 53 – 54","(en blanco)",1]
["TRABAJO EN ALTURA ","Entrenamiento para trabajos en alturas -  (Reentrenamiento)","Personal con exposición a peligro por condición de seguridad, trabajo en alturas","PRESENCIAL ","BOGOTÁ","2019-11-01","8:00 am - 5:00 pm\n20 HORAS\n","Sede Complejo Cazuca – Autopista sur Carrera 4ª N° 53 – 54","(en blanco)",1]
["TRABAJO EN ALTURA ","Entrenamiento para trabajos en alturas -  (Reentrenamiento)","Personal con exposición a peligro por condición de seguridad, trabajo en alturas","PRESENCIAL ","BOGOTÁ","2019-12-01","8:00 am - 5:00 pm\n20 HORAS\n","Sede Complejo Cazuca – Autopista sur Carrera 4ª N° 53 – 54","(en blanco)",1]
["TRABAJO EN ALTURA ","Entrenamiento para trabajos en alturas (Avanzado) - Nivel Avanzado: 40 horas; de las cuales mínimo 16 serán teóricas y 24 de entrenamiento práctico","Personal con exposición a peligro por condición de seguridad, trabajo en alturas","PRESENCIAL ","BOGOTÁ","2019-02-01","8:00 am - 5:00 pm\n40 HORAS\n","Sede Complejo Cazuca – Autopista sur Carrera 4ª N° 53 – 54","(en blanco)",1]
["TRABAJO EN ALTURA ","Entrenamiento para trabajos en alturas (Avanzado) - Nivel Avanzado: 40 horas; de las cuales mínimo 16 serán teóricas y 24 de entrenamiento práctico","Personal con exposición a peligro por condición de seguridad, trabajo en alturas","PRESENCIAL ","BOGOTÁ","2019-01-01","8:00 am - 5:00 pm\n40 HORAS\n","Sede Complejo Cazuca – Autopista sur Carrera 4ª N° 53 – 54","(en blanco)",1]
["TRABAJO EN ALTURA ","Entrenamiento para trabajos en alturas (Avanzado) - Nivel Avanzado: 40 horas; de las cuales mínimo 16 serán teóricas y 24 de entrenamiento práctico","Personal con exposición a peligro por condición de seguridad, trabajo en alturas","PRESENCIAL ","BOGOTÁ","2019-03-01","8:00 am - 5:00 pm\n40 HORAS\n","Sede Complejo Cazuca – Autopista sur Carrera 4ª N° 53 – 54","(en blanco)",1]
["TRABAJO EN ALTURA ","Entrenamiento para trabajos en alturas (Avanzado) - Nivel Avanzado: 40 horas; de las cuales mínimo 16 serán teóricas y 24 de entrenamiento práctico","Personal con exposición a peligro por condición de seguridad, trabajo en alturas","PRESENCIAL ","BOGOTÁ","2019-04-01","8:00 am - 5:00 pm\n40 HORAS\n","Sede Complejo Cazuca – Autopista sur Carrera 4ª N° 53 – 54","(en blanco)",1]
["TRABAJO EN ALTURA ","Entrenamiento para trabajos en alturas (Avanzado) - Nivel Avanzado: 40 horas; de las cuales mínimo 16 serán teóricas y 24 de entrenamiento práctico","Personal con exposición a peligro por condición de seguridad, trabajo en alturas","PRESENCIAL ","BOGOTÁ","2019-05-01","8:00 am - 5:00 pm\n40 HORAS\n","Sede Complejo Cazuca – Autopista sur Carrera 4ª N° 53 – 54","(en blanco)",1]
["TRABAJO EN ALTURA ","Entrenamiento para trabajos en alturas (Avanzado) - Nivel Avanzado: 40 horas; de las cuales mínimo 16 serán teóricas y 24 de entrenamiento práctico","Personal con exposición a peligro por condición de seguridad, trabajo en alturas","PRESENCIAL ","BOGOTÁ","2019-06-01","8:00 am - 5:00 pm\n40 HORAS\n","Sede Complejo Cazuca – Autopista sur Carrera 4ª N° 53 – 54","(en blanco)",1]
["TRABAJO EN ALTURA ","Entrenamiento para trabajos en alturas (Avanzado) - Nivel Avanzado: 40 horas; de las cuales mínimo 16 serán teóricas y 24 de entrenamiento práctico","Personal con exposición a peligro por condición de seguridad, trabajo en alturas","PRESENCIAL ","BOGOTÁ","2019-07-01","8:00 am - 5:00 pm\n40 HORAS\n","Sede Complejo Cazuca – Autopista sur Carrera 4ª N° 53 – 54","(en blanco)",1]
["TRABAJO EN ALTURA ","Entrenamiento para trabajos en alturas (Avanzado) - Nivel Avanzado: 40 horas; de las cuales mínimo 16 serán teóricas y 24 de entrenamiento práctico","Personal con exposición a peligro por condición de seguridad, trabajo en alturas","PRESENCIAL ","BOGOTÁ","2019-08-01","8:00 am - 5:00 pm\n40 HORAS\n","Sede Complejo Cazuca – Autopista sur Carrera 4ª N° 53 – 54","(en blanco)",1]
["TRABAJO EN ALTURA ","Entrenamiento para trabajos en alturas (Avanzado) - Nivel Avanzado: 40 horas; de las cuales mínimo 16 serán teóricas y 24 de entrenamiento práctico","Personal con exposición a peligro por condición de seguridad, trabajo en alturas","PRESENCIAL ","BOGOTÁ","2018-09-01","8:00 am - 5:00 pm\n40 HORAS\n","Sede Complejo Cazuca – Autopista sur Carrera 4ª N° 53 – 54","(en blanco)",1]
["TRABAJO EN ALTURA ","Entrenamiento para trabajos en alturas (Avanzado) - Nivel Avanzado: 40 horas; de las cuales mínimo 16 serán teóricas y 24 de entrenamiento práctico","Personal con exposición a peligro por condición de seguridad, trabajo en alturas","PRESENCIAL ","BOGOTÁ","2019-10-01","8:00 am - 5:00 pm\n40 HORAS\n","Sede Complejo Cazuca – Autopista sur Carrera 4ª N° 53 – 54","(en blanco)",1]
["TRABAJO EN ALTURA ","Entrenamiento para trabajos en alturas (Avanzado) - Nivel Avanzado: 40 horas; de las cuales mínimo 16 serán teóricas y 24 de entrenamiento práctico","Personal con exposición a peligro por condición de seguridad, trabajo en alturas","PRESENCIAL ","BOGOTÁ","2019-12-01","8:00 am - 5:00 pm\n40 HORAS\n","Sede Complejo Cazuca – Autopista sur Carrera 4ª N° 53 – 54","(en blanco)",1]
["(en blanco)","(en blanco)","(en blanco)","(en blanco)","(en blanco)","(en blanco)","(en blanco)","(en blanco)","(en blanco)"]
["(en blanco)","(en blanco)","(en blanco)","(en blanco)","(en blanco)","ver","(en blanco)","(en blanco)","(en blanco)"]
["ERGONOMIA","Curso Ergonomía","Personal con exposición a peligro biomecanico y responsable de SG - SST ","VIRTUAL ","NACIONAL","2019-10-31","Abierto ","Liberty University",200,1]
["LIBERTY MUTUAL ","Construction Safety Tools - Just a Click Away","Requisito manejo del Inglés","VIRTUAL ","NACIONAL","2019-02-07","2:00 - 3:00 p.m.","LIBERTY MUTUAL","(en blanco)",1]
["LIBERTY MUTUAL ","Risk Control Services: A Virtual Overview","Requisito manejo del Inglés","VIRTUAL ","NACIONAL","2019-03-05","2:00 - 3:00 p.m.","LIBERTY MUTUAL","(en blanco)",1]
["LIBERTY MUTUAL ","Risk Control Services: A Virtual Overview","Requisito manejo del Inglés","VIRTUAL ","NACIONAL","2019-09-05","2:00 - 3:00 p.m.","LIBERTY MUTUAL","(en blanco)",1]
["LIBERTY MUTUAL ","Safe Patient/Resident Mobilization","Requisito manejo del Inglés","VIRTUAL ","NACIONAL","2019-03-13","2:00 - 3:00 p.m.","LIBERTY MUTUAL","(en blanco)",1]
["LIBERTY MUTUAL ","Silica: Competent Person and Control Plan Development","Requisito manejo del Inglés","VIRTUAL ","NACIONAL","2019-03-21","2:00 - 3:00 p.m.","LIBERTY MUTUAL","(en blanco)",1]
["LIBERTY MUTUAL ","Silica: Competent Person and Control Plan Development","Requisito manejo del Inglés","VIRTUAL ","NACIONAL","2019-04-02","2:00 - 3:00 p.m.","LIBERTY MUTUAL","(en blanco)",1]
["LIBERTY MUTUAL ","Controlling Distracted Driving","Requisito manejo del Inglés","VIRTUAL ","NACIONAL","2019-05-11","2:00 - 3:00 p.m.","LIBERTY MUTUAL","(en blanco)",1]
["LIBERTY MUTUAL ","Prevention through Design","Requisito manejo del Inglés","VIRTUAL ","NACIONAL","2019-05-08","2:00 - 3:00 p.m.","LIBERTY MUTUAL","(en blanco)",1]
["LIBERTY MUTUAL ","Prevention through Design (PtD)","Requisito manejo del Inglés","VIRTUAL ","NACIONAL","2019-05-08","2:00 - 3:00 p.m.","LIBERTY MUTUAL","(en blanco)",1]
["LIBERTY MUTUAL ","Opioids in the Workplace","Requisito manejo del Inglés","VIRTUAL ","NACIONAL","2019-05-14","2:00 - 3:00 p.m.","LIBERTY MUTUAL","(en blanco)",1]
["LIBERTY MUTUAL ","Journey Management","Requisito manejo del Inglés","VIRTUAL ","NACIONAL","2019-05-16","2:00 - 3:00 p.m.","LIBERTY MUTUAL","(en blanco)",1]
["LIBERTY MUTUAL ","Management Systems for Occupational Health & Safety","Requisito manejo del Inglés","VIRTUAL ","NACIONAL","2019-05-23","2:00 - 3:00 p.m.","LIBERTY MUTUAL","(en blanco)",1]
["LIBERTY MUTUAL ","Slip, Trips and Falls Prevention","Requisito manejo del Inglés","VIRTUAL ","NACIONAL","2019-06-04","2:00 - 3:00 p.m.","LIBERTY MUTUAL","(en blanco)",1]
["LIBERTY MUTUAL ","Business Continuity - Planning for the Unexpected","Requisito manejo del Inglés","VIRTUAL ","NACIONAL","2019-06-05","2:00 - 3:00 p.m.","LIBERTY MUTUAL","(en blanco)",1]
["LIBERTY MUTUAL ","Safety Climate - The Pulse of Safety in Organizations","Requisito manejo del Inglés","VIRTUAL ","NACIONAL","2019-05-11","2:00 - 3:00 p.m.","LIBERTY MUTUAL","(en blanco)",1]
["LIBERTY MUTUAL ","General Liability Incident Response","Requisito manejo del Inglés","VIRTUAL ","NACIONAL","2019-09-19","2:00 - 3:00 p.m.","LIBERTY MUTUAL","(en blanco)",1]
["LIBERTY MUTUAL ","Getting Results: Coaching & Feedback for Supervisors","Requisito manejo del Inglés","VIRTUAL ","NACIONAL","2019-10-10","2:00 - 3:00 p.m.","LIBERTY MUTUAL","(en blanco)",1]
["LIBERTY MUTUAL ","Active Shooter/Workplace Violence - Managing the Crisis","Requisito manejo del Inglés","VIRTUAL ","NACIONAL","2019-10-23","2:00 - 3:00 p.m.","LIBERTY MUTUAL","(en blanco)",1]
["MANEJO SEGURO DE ESCALERAS","Curso sobre manejo seguro de escaleras ","Responsable del sistema de gestión, supervisores y trabajares.","VIRTUAL ","NACIONAL","2019-04-10","2:00 - 4:00 p.m.","Liberty University",200,1]
["ACOSO LABORAL ","Acoso Laboral (Aula viviendo en armonía).","Trabajadores afiliados a Liberty","VIRTUAL ","NACIONAL","2019-10-31","Abierto","Liberty University",200,1]
["GESTION DEL RIESGO BAJO LA 31000 ","Propósito de la norma ISO 31000. ","Los participantes deben estar afiliados a la ARL LIBERTY.","VIRTUAL ","NACIONAL","2019-05-27","10:00 a.m. a 12:00 m","Liberty University",200,1]
["TAREAS DE ALTO RIESGO (Curso Administración de tareas de alto riesgo)","1. Administración de tareas de alto riesgo.\n2. Espacios confinados\n3. Trabajo en alturas\n4. Energías peligrosas\n5. Izaje de cargas\n6. Exposición a riesgo químico\n7. Trabajos en caliente\n8. Trabajo seguro en excavaciones\n","Los participantes deben estar afiliados a ARL Liberty y tener a cargo el SG-SST. Personal con exposición a peligro por condición de seguridad, trabajo en alturas.","VIRTUAL ","NACIONAL","2019-10-31","Abierto ","Liberty University",200,1]
["PREVENCIÓN DE CONSUMO DE SUSTANCIAS PSICOACTIVAS. SIN ADICCIÓN ME QUIERO MÁS. ","Capacitación sobre herramientas de  prevención  en el consumo de alcohol y sustancias psicoactivas en el ámbito laboral.  Programa Sin adicción me quiero más de ARL Liberty. ","Los participantes deben estar afiliados a la ARL LIBERTY  y  tener a cargo el Sistema de Gestión de Seguridad y Salud en el Trabajo o pertenecer al área de Recursos Humanos","VIRTUAL ","NACIONAL","2019-10-31","Abierto ","Liberty University",200,1]
["RECLASIFICACIÓN DE RIESGOS ","Explica el concepto y proceso de reclasificación; cuándo es procendente realizarlo y cuándo no.  ","Dirigido para encargados del Sistema de Gestión de Seguridad y Salud en el Trabajo y personal del área de Talento Humano. ","VIRTUAL ","NACIONAL","2019-10-31","Abierto","Liberty University","(en blanco)",1]
["GESTIÓN EFECTIVA DEL COMITÉ PARITARIO DE SALUD OCUPACIONAL COPASST","Capacitación copasst   (Inspecciones de seguridad, Investigación accidentes de trabajo, Elementos de Protección Personal, Hábitos saludables, primeros auxilios, Liderazo). Conozca más sobre la Herramienta de Excel CIL copasst Interactivo. ","Dirigida a los Comités Paritarios de Salud Ocupacional. ","VIRTUAL ","NACIONAL","2019-10-31","Abierto ","Liberty University",200,1]

{"sheet":"PRESENCIAL NACIONAL - VIRTUALES","index":4,"n_rows":431,"n_cols":18,"rows_kept":431,"cut":false,"hidden":true,"merged":[]}
[null,"PROGRAMA","TEMA","PERFIL DE LOS ASISTENTES","MODALIDAD ","CIUDAD","HORARIO","FECHA","LUGAR","ÁREA RESPONSABLE","Mes","MÁXIMO DE ASISTENTES ","PROMEDIO ASISTENTES POR EMPRESA","ASESOR",null,"HORAS","ver","ver"]
[null,"TRABAJO EN ALTURA ","Entrenamiento para trabajos en alturas (Avanzado) - Nivel Avanzado: 40 horas; de las cuales mínimo 16 serán teóricas y 24 de entrenamiento práctico","Personal con exposición a peligro por condición de seguridad, trabajo en alturas","PRESENCIAL ","BOGOTÁ","8:00 am - 5:00 pm\n40 HORAS\n","2019-01-01","Sede Complejo Cazuca – Autopista sur Carrera 4ª N° 53 – 54","PYP",{"$f":"UPPER(TEXT(H2,\"mmmm\"))","v":"ENERO"},25,null,"SENA",null,40]
[null,"TRABAJO EN ALTURA ","Entrenamiento para trabajos en alturas (Avanzado) - Nivel Avanzado: 40 horas; de las cuales mínimo 16 serán teóricas y 24 de entrenamiento práctico","Personal con exposición a peligro por condición de seguridad, trabajo en alturas","PRESENCIAL ","BOGOTÁ","8:00 am - 5:00 pm\n40 HORAS\n","2019-02-01","Sede Complejo Cazuca – Autopista sur Carrera 4ª N° 53 – 54","PYP","FEBRERO",25,null,"SENA",null,40]
[null,"TRABAJO EN ALTURA ","Entrenamiento para trabajos en alturas (Avanzado) - Nivel Avanzado: 40 horas; de las cuales mínimo 16 serán teóricas y 24 de entrenamiento práctico","Personal con exposición a peligro por condición de seguridad, trabajo en alturas","PRESENCIAL ","BOGOTÁ","8:00 am - 5:00 pm\n40 HORAS\n","2019-03-01","Sede Complejo Cazuca – Autopista sur Carrera 4ª N° 53 – 54","PYP","MARZO",25,null,"SENA",null,40]
[null,"TRABAJO EN ALTURA ","Entrenamiento para trabajos en alturas (Avanzado) - Nivel Avanzado: 40 horas; de las cuales mínimo 16 serán teóricas y 24 de entrenamiento práctico","Personal con exposición a peligro por condición de seguridad, trabajo en alturas","PRESENCIAL ","BOGOTÁ","8:00 am - 5:00 pm\n40 HORAS\n","2019-04-01","Sede Complejo Cazuca – Autopista sur Carrera 4ª N° 53 – 54","PYP","ABRIL",25,null,"SENA",null,40]
[null,"TRABAJO EN ALTURA ","Entrenamiento para trabajos en alturas (Avanzado) - Nivel Avanzado: 40 horas; de las cuales mínimo 16 serán teóricas y 24 de entrenamiento práctico","Personal con exposición a peligro por condición de seguridad, trabajo en alturas","PRESENCIAL ","BOGOTÁ","8:00 am - 5:00 pm\n40 HORAS\n","2019-05-01","Sede Complejo Cazuca – Autopista sur Carrera 4ª N° 53 – 54","PYP","MAYO",25,null,"SENA",null,40]
[null,"TRABAJO EN ALTURA ","Entrenamiento para trabajos en alturas (Avanzado) - Nivel Avanzado: 40 horas; de las cuales mínimo 16 serán teóricas y 24 de entrenamiento práctico","Personal con exposición a peligro por condición de seguridad, trabajo en alturas","PRESENCIAL ","BOGOTÁ","8:00 am - 5:00 pm\n40 HORAS\n","2019-06-01","Sede Complejo Cazuca – Autopista sur Carrera 4ª N° 53 – 54","PYP","JUNIO",25,null,"SENA",null,40]
[null,"TRABAJO EN ALTURA ","Entrenamiento para trabajos en alturas (Avanzado) - Nivel Avanzado: 40 horas; de las cuales mínimo 16 serán teóricas y 24 de entrenamiento práctico","Personal con exposición a peligro por condición de seguridad, trabajo en alturas","PRESENCIAL ","BOGOTÁ","8:00 am - 5:00 pm\n40 HORAS\n","2019-07-01","Sede Complejo Cazuca – Autopista sur Carrera 4ª N° 53 – 54","PYP","JULIO",25,null,"SENA",null,40]
[null,"TRABAJO EN ALTURA ","Entrenamiento para trabajos en alturas (Avanzado) - Nivel Avanzado: 40 horas; de las cuales mínimo 16 serán teóricas y 24 de entrenamiento práctico","Personal con exposición a peligro por condición de seguridad, trabajo en alturas","PRESENCIAL ","BOGOTÁ","8:00 am - 5:00 pm\n40 HORAS\n","2019-08-01","Sede Complejo Cazuca – Autopista sur Carrera 4ª N° 53 – 54","PYP","AGOSTO",25,null,"SENA",null,40]
[null,"TRABAJO EN ALTURA ","Entrenamiento para trabajos en alturas (Avanzado) - Nivel Avanzado: 40 horas; de las cuales mínimo 16 serán teóricas y 24 de entrenamiento práctico","Personal con exposición a peligro por condición de seguridad, trabajo en alturas","PRESENCIAL ","BOGOTÁ","8:00 am - 5:00 pm\n40 HORAS\n","2018-09-01","Sede Complejo Cazuca – Autopista sur Carrera 4ª N° 53 – 54","PYP","SEPTIEMBRE",25,null,"SENA",null,40]
[null,"TRABAJO EN ALTURA ","Entrenamiento para trabajos en alturas (Avanzado) - Nivel Avanzado: 40 horas; de las cuales mínimo 16 serán teóricas y 24 de entrenamiento práctico","Personal con exposición a peligro por condición de seguridad, trabajo en alturas","PRESENCIAL ","BOGOTÁ","8:00 am - 5:00 pm\n40 HORAS\n","2019-10-01","Sede Complejo Cazuca – Autopista sur Carrera 4ª N° 53 – 54","PYP","OCTUBRE",25,null,"SENA",null,40]
[null,"TRABAJO EN ALTURA ","Entrenamiento para trabajos en alturas (Avanzado) - Nivel Avanzado: 40 horas; de las cuales mínimo 16 serán teóricas y 24 de entrenamiento práctico","Personal con exposición a peligro por condición de seguridad, trabajo en alturas","PRESENCIAL ","BOGOTÁ","8:00 am - 5:00 pm\n40 HORAS\n","2019-12-01","Sede Complejo Cazuca – Autopista sur Carrera 4ª N° 53 – 54","PYP","DICIEMBRE",25,null,"SENA",null,40]
[null,"TRABAJO EN ALTURA ","Entrenamiento para trabajos en alturas -  (Reentrenamiento)","Personal con exposición a peligro por condición de seguridad, trabajo en alturas","PRESENCIAL ","BOGOTÁ","8:00 am - 5:00 pm\n20 HORAS\n","2019-01-01","Sede Complejo Cazuca – Autopista sur Carrera 4ª N° 53 – 54","PYP","ENERO",25,null,"SENA",null,20]
[null,"TRABAJO EN ALTURA ","Entrenamiento para trabajos en alturas -  (Reentrenamiento)","Personal con exposición a peligro por condición de seguridad, trabajo en alturas","PRESENCIAL ","BOGOTÁ","8:00 am - 5:00 pm\n20 HORAS\n","2019-02-01","Sede Complejo Cazuca – Autopista sur Carrera 4ª N° 53 – 54","PYP","FEBRERO",25,null,"SENA",null,20]
[null,"TRABAJO EN ALTURA ","Entrenamiento para trabajos en alturas -  (Reentrenamiento)","Personal con exposición a peligro por condición de seguridad, trabajo en alturas","PRESENCIAL ","BOGOTÁ","8:00 am - 5:00 pm\n20 HORAS\n","2019-03-01","Sede Complejo Cazuca – Autopista sur Carrera 4ª N° 53 – 54","PYP","MARZO",25,null,"SENA",null,20]
[null,"TRABAJO EN ALTURA ","Entrenamiento para trabajos en alturas -  (Reentrenamiento)","Personal con exposición a peligro por condición de seguridad, trabajo en alturas","PRESENCIAL ","BOGOTÁ","8:00 am - 5:00 pm\n20 HORAS\n","2019-04-01","Sede Complejo Cazuca – Autopista sur Carrera 4ª N° 53 – 54","PYP","ABRIL",25,null,"SENA",null,20]
[null,"TRABAJO EN ALTURA ","Entrenamiento para trabajos en alturas -  (Reentrenamiento)","Personal con exposición a peligro por condición de seguridad, trabajo en alturas","PRESENCIAL ","BOGOTÁ","8:00 am - 5:00 pm\n20 HORAS\n","2019-05-01","Sede Complejo Cazuca – Autopista sur Carrera 4ª N° 53 – 54","PYP","MAYO",25,null,"SENA",null,20]
[null,"TRABAJO EN ALTURA ","Entrenamiento para trabajos en alturas -  (Reentrenamiento)","Personal con exposición a peligro por condición de seguridad, trabajo en alturas","PRESENCIAL ","BOGOTÁ","8:00 am - 5:00 pm\n20 HORAS\n","2019-06-01","Sede Complejo Cazuca – Autopista sur Carrera 4ª N° 53 – 54","PYP","JUNIO",25,null,"SENA",null,20]
[null,"TRABAJO EN ALTURA ","Entrenamiento para trabajos en alturas -  (Reentrenamiento)","Personal con exposición a peligro por condición de seguridad, trabajo en alturas","PRESENCIAL ","BOGOTÁ","8:00 am - 5:00 pm\n20 HORAS\n","2019-07-01","Sede Complejo Cazuca – Autopista sur Carrera 4ª N° 53 – 54","PYP","JULIO",25,null,"SENA",null,20]
[null,"TRABAJO EN ALTURA ","Entrenamiento para trabajos en alturas -  (Reentrenamiento)","Personal con exposición a peligro por condición de seguridad, trabajo en alturas","PRESENCIAL ","BOGOTÁ","8:00 am - 5:00 pm\n20 HORAS\n","2019-08-01","Sede Complejo Cazuca – Autopista sur Carrera 4ª N° 53 – 54","PYP","AGOSTO",25,null,"SENA",null,20]
[null,"TRABAJO EN ALTURA ","Entrenamiento para trabajos en alturas -  (Reentrenamiento)","Personal con exposición a peligro por condición de seguridad, trabajo en alturas","PRESENCIAL ","BOGOTÁ","8:00 am - 5:00 pm\n20 HORAS\n","2018-09-01","Sede Complejo Cazuca – Autopista sur Carrera 4ª N° 53 – 54","PYP","SEPTIEMBRE",25,null,"SENA",null,20]
[null,"TRABAJO EN ALTURA ","Entrenamiento para trabajos en alturas -  (Reentrenamiento)","Personal con exposición a peligro por condición de seguridad, trabajo en alturas","PRESENCIAL ","BOGOTÁ","8:00 am - 5:00 pm\n20 HORAS\n","2019-10-01","Sede Complejo Cazuca – Autopista sur Carrera 4ª N° 53 – 54","PYP","OCTUBRE",25,null,"SENA",null,20]
[null,"TRABAJO EN ALTURA ","Entrenamiento para trabajos en alturas -  (Reentrenamiento)","Personal con exposición a peligro por condición de seguridad, trabajo en alturas","PRESENCIAL ","BOGOTÁ","8:00 am - 5:00 pm\n20 HORAS\n","2019-11-01","Sede Complejo Cazuca – Autopista sur Carrera 4ª N° 53 – 54","PYP","NOVIEMBRE",25,null,"SENA",null,20]
[null,"TRABAJO EN ALTURA ","Entrenamiento para trabajos en alturas -  (Reentrenamiento)","Personal con exposición a peligro por condición de seguridad, trabajo en alturas","PRESENCIAL ","BOGOTÁ","8:00 am - 5:00 pm\n20 HORAS\n","2019-12-01","Sede Complejo Cazuca – Autopista sur Carrera 4ª N° 53 – 54","PYP","DICIEMBRE",25,null,"SENA",null,20]
[null,"TAREAS DE ALTO RIESGO (Curso Administración de tareas de alto riesgo)","1. Administración de tareas de alto riesgo.\n2. Espacios confinados\n3. Trabajo en alturas\n4. Energías peligrosas\n5. Izaje de cargas\n6. Exposición a riesgo químico\n7. Trabajos en caliente\n8. Trabajo seguro en excavaciones\n","Los participantes deben estar afiliados a ARL Liberty y tener a cargo el SG-SST. Personal con exposición a peligro por condición de seguridad, trabajo en alturas.","VIRTUAL ","NACIONAL","Abierto ",{"$f":"+IF(O25>=TODAY(),O25,TODAY()+2)","v":"2019-10-31"},"Liberty University","PYP ","OCTUBRE","Abierto",200,null,"2019-01-01",40]
[null,"TAREAS DE ALTO RIESGO ","Curso tareas de alto riesgo. Módulo 1: Seguridad eléctrica  ","Personal responsable del sistema de gestión, líderes de proceso, copasst. ","PRESENCIAL ","BOGOTÁ","8:00 a.m. - 12:00 m","2019-07-11","Calle 73 N° 10 - 83 Torre C Oficina 302. Salón 302 Fucsia","ESPECIALISTA P Y P ","JULIO",40,2,null,null,4]
[null,"TAREAS DE ALTO RIESGO ","Creación UVAE Ministerio de trabajo ","Personal responsable del sistema de gestión, líderes de proceso, copasst. ","VIRTUAL ","NACIONAL","2:00 p.m. - 5:00 p.m.","2019-08-01","Liberty University","pyp ","AGOSTO","Abierto",200,"Montajes y procesos mgonzalez@montajesyprocesos.com","2019-08-08",2]
[null,"TAREAS DE ALTO RIESGO ","Curso tareas de alto riesgo. Módulo 2: Operación segura de maquinaria ","Personal responsable del sistema de gestión, líderes de proceso, copasst. ","PRESENCIAL ","BOGOTÁ","8:00 a.m. - 12:00 m","2019-08-15","Calle 73 N° 10 - 83 Torre C Oficina 302. Salón 302 Fucsia","ESPECIALISTA P Y P ","AGOSTO",40,2,"Montajes y procesos mgonzalez@montajesyprocesos.com",null,4]
[null,"TAREAS DE ALTO RIESGO ","Curso tareas de alto riesgo. Módulo 3: Espacio confinado y atmósferas peligrosas.   Seguridad en excavaciones.  ","Personal responsable del sistema de gestión, líderes de proceso, copasst. ","PRESENCIAL ","BOGOTÁ","8:00 a.m. - 12:00 m","2019-09-26","Calle 73 N° 10 - 83 Torre C Oficina 302. Salón 302 Fucsia","ESPECIALISTA P Y P ","SEPTIEMBRE",40,2,null,null,4]
[null,"TAREAS DE ALTO RIESGO ","Curso tareas de alto riesgo. Módulo 4: Elaboración de procedimientos seguros, Análisis de tareas seguras y permisos de trabajo. ","Personal responsable del sistema de gestión, líderes de proceso, copasst. ","PRESENCIAL ","BOGOTÁ","8:00 a.m. - 12:00 m","2019-11-08","Calle 73 N° 10 - 83 Torre C Oficina 302. Salón 302 Fucsia","ESPECIALISTA P Y P ","NOVIEMBRE",40,2,"Montajes y procesos mgonzalez@montajesyprocesos.com",null,4]
[null,"TAREAS DE ALTO RIESGO ","Curso tareas de alto riesgo. Módulo 1: Seguridad eléctrica  ","Personal responsable del sistema de gestión, líderes de proceso, copasst. ","PRESENCIAL ","BARRANCABERMEJA","8:00 a.m. - 12:00 m","2019-07-11","Hotel San Silvestre Cra 19 # 58a–13","GPS CIUDAD",{"$f":"UPPER(TEXT(H31,\"mmmm\"))","v":"JULIO"},25,2,null,null,4]
[null,"TAREAS DE ALTO RIESGO ","Curso tareas de alto riesgo. Módulo 2: Operación segura de maquinaria ","Personal responsable del sistema de gestión, líderes de proceso, copasst. ","PRESENCIAL ","BARRANCABERMEJA","8:00 a.m. - 12:00 m","2019-08-15","Hotel San Silvestre Cra 19 # 58a–13","GPS CIUDAD","AGOSTO",25,2,null,null,4]
[null,"TAREAS DE ALTO RIESGO ","Curso tareas de alto riesgo. Módulo 3: Espacio confinado y atmósferas peligrosas.   Seguridad en excavaciones.  ","Personal responsable del sistema de gestión, líderes de proceso, copasst. ","PRESENCIAL ","BARRANCABERMEJA","8:00 a.m. - 12:00 m","2019-09-12","Hotel San Silvestre Cra 19 # 58a–13","GPS CIUDAD","SEPTIEMBRE",25,2,null,null,4]
[null,"TAREAS DE ALTO RIESGO ","Curso tareas de alto riesgo. Módulo 4: Elaboración de procedimientos seguros, Análisis de tareas seguras y permisos de trabajo. ","Personal responsable del sistema de gestión, líderes de proceso, copasst. ","PRESENCIAL ","BARRANCABERMEJA","8:00 a.m. - 12:00 m","2019-11-07","Hotel San Silvestre Cra 19 # 58a–13","GPS CIUDAD","NOVIEMBRE",25,2,null,null,4]
[null,"TAREAS DE ALTO RIESGO ","Curso tareas de alto riesgo. Módulo 1: Seguridad eléctrica  ","Personal responsable del sistema de gestión, líderes de proceso, copasst. ","PRESENCIAL ","BARRANQUILLA","8:00 a.m. - 12:00 m","2019-06-20","ICONTEC Cra 57 No. 70-89 Barranquilla","GPS CIUDAD","JUNIO",25,3,null,null,4]
[null,"TAREAS DE ALTO RIESGO ","Curso tareas de alto riesgo. Módulo 2: Operación segura de maquinaria ","Personal responsable del sistema de gestión, líderes de proceso, copasst. ","PRESENCIAL ","BARRANQUILLA","8:00 a.m. - 12:00 m","2019-07-04","ICONTEC Cra 57 No. 70-89 Barranquilla","GPS CIUDAD","JULIO",25,3,null,null,4]
[null,"TAREAS DE ALTO RIESGO ","Curso tareas de alto riesgo. Módulo 3: Espacio confinado y atmósferas peligrosas.   Seguridad en excavaciones.  ","Personal responsable del sistema de gestión, líderes de proceso, copasst. ","PRESENCIAL ","BARRANQUILLA","8:00 a.m. - 12:00 m","2019-07-18","ICONTEC Cra 57 No. 70-89 Barranquilla","GPS CIUDAD","JULIO",25,3,null,null,4]
[null,"TAREAS DE ALTO RIESGO ","Curso tareas de alto riesgo. Módulo 4: Elaboración de procedimientos seguros, Análisis de tareas seguras y permisos de trabajo. ","Personal responsable del sistema de gestión, líderes de proceso, copasst. ","PRESENCIAL ","BARRANQUILLA","8:00 a.m. - 12:00 m","2019-08-01","ICONTEC Cra 57 No. 70-89 Barranquilla","GPS CIUDAD","AGOSTO",25,3,null,null,4]
[null,"TAREAS DE ALTO RIESGO ","Curso tareas de alto riesgo. Módulo 1: Seguridad eléctrica  ","Personal responsable del sistema de gestión, líderes de proceso, copasst. ","PRESENCIAL ","BUCARAMANGA","8:00 a.m. - 12:00 m","2019-07-11","Hotel La Triada Cra. 20 # 34—22","GPS CIUDAD","JULIO",25,2,null,null,4]
[null,"TAREAS DE ALTO RIESGO ","Curso tareas de alto riesgo. Módulo 2: Operación segura de maquinaria ","Personal responsable del sistema de gestión, líderes de proceso, copasst. ","PRESENCIAL ","BUCARAMANGA","8:00 a.m. - 12:00 m","2019-08-15","Hotel La Triada Cra. 20 # 34—22","GPS CIUDAD","AGOSTO",25,2,null,null,4]
[null,"TAREAS DE ALTO RIESGO ","Curso tareas de alto riesgo. Módulo 3: Espacio confinado y atmósferas peligrosas.   Seguridad en excavaciones.  ","Personal responsable del sistema de gestión, líderes de proceso, copasst. ","PRESENCIAL ","BUCARAMANGA","8:00 a.m. - 12:00 m","2019-09-12","Hotel La Triada Cra. 20 # 34—22","GPS CIUDAD","SEPTIEMBRE",25,2,null,null,4]
[null,"TAREAS DE ALTO RIESGO ","Curso tareas de alto riesgo. Módulo 4: Elaboración de procedimientos seguros, Análisis de tareas seguras y permisos de trabajo. ","Personal responsable del sistema de gestión, líderes de proceso, copasst. ","PRESENCIAL ","BUCARAMANGA","8:00 a.m. - 12:00 m","2019-11-07","Hotel La Triada Cra. 20 #34--22","GPS CIUDAD","NOVIEMBRE",25,2,null,null,4]
[null,"TAREAS DE ALTO RIESGO ","Curso tareas de alto riesgo. Módulo 1: Seguridad eléctrica  ","Personal responsable del sistema de gestión, líderes de proceso, copasst. ","PRESENCIAL ","CALI","8:00 a.m. - 12:00 m","2019-07-11","Av. 5 Norte # 38N-81","GPS CIUDAD","JULIO",30,2,"SAFE SAS",null,4]
[null,"TAREAS DE ALTO RIESGO ","Curso tareas de alto riesgo. Módulo 2: Operación segura de maquinaria ","Personal responsable del sistema de gestión, líderes de proceso, copasst. ","PRESENCIAL ","CALI","8:00 a.m. - 12:00 m","2019-08-16","Av. 5 Norte # 38N-81","GPS CIUDAD","AGOSTO",30,2,"SAFE SAS",null,4]
[null,"TAREAS DE ALTO RIESGO ","Curso tareas de alto riesgo. Módulo 3: Espacio confinado y atmósferas peligrosas.   Seguridad en excavaciones.  ","Personal responsable del sistema de gestión, líderes de proceso, copasst. ","PRESENCIAL ","CALI","8:00 a.m. - 12:00 m","2019-09-13","Av. 5 Norte # 38N-81","GPS CIUDAD","SEPTIEMBRE",30,2,"SAFE SAS",null,4]
[null,"TAREAS DE ALTO RIESGO ","Curso tareas de alto riesgo. Módulo 4: Elaboración de procedimientos seguros, Análisis de tareas seguras y permisos de trabajo. ","Personal responsable del sistema de gestión, líderes de proceso, copasst. ","PRESENCIAL ","CALI","8:00 a.m. - 12:00 m","2019-11-21","Av. 5 Norte # 38N-81","GPS CIUDAD","NOVIEMBRE",30,2,"SAFE SAS",null,4]
[null,"TAREAS DE ALTO RIESGO ","Curso tareas de alto riesgo. Módulo 1: Seguridad eléctrica  ","Personal responsable del sistema de gestión, líderes de proceso, copasst. ","PRESENCIAL ","CARTAGENA","8:00 a.m. - 12:00 m","2019-07-11","Liberty Seguros, Calle del Arsenal No 8B-195 piso 1","GPS CIUDAD","JULIO",25,2,"Gestión Interriesgos",null,4]
[null,"TAREAS DE ALTO RIESGO ","Curso tareas de alto riesgo. Módulo 2: Operación segura de maquinaria ","Personal responsable del sistema de gestión, líderes de proceso, copasst. ","PRESENCIAL ","CARTAGENA","8:00 a.m. - 12:00 m","2019-08-15","Liberty Seguros, Calle del Arsenal No 8B-195 piso 1","GPS CIUDAD","AGOSTO",25,2,"Estrategias y soluciones en gestión del riesgo",null,4]
[null,"TAREAS DE ALTO RIESGO ","Curso tareas de alto riesgo. Módulo 3: Espacio confinado y atmósferas peligrosas.   Seguridad en excavaciones.  ","Personal responsable del sistema de gestión, líderes de proceso, copasst. ","PRESENCIAL ","CARTAGENA","8:00 a.m. - 12:00 m","2019-09-16","Liberty Seguros, Calle del Arsenal No 8B-195 piso 1","GPS CIUDAD","SEPTIEMBRE",25,2,"Estrategias y soluciones en gestión del riesgo",null,4]
[null,"TAREAS DE ALTO RIESGO ","Curso tareas de alto riesgo. Módulo 4: Elaboración de procedimientos seguros, Análisis de tareas seguras y permisos de trabajo. ","Personal responsable del sistema de gestión, líderes de proceso, copasst. ","PRESENCIAL ","CARTAGENA","8:00 a.m. - 12:00 m","2019-11-06","Liberty Seguros, Calle del Arsenal No 8B-195 piso 1","GPS CIUDAD","NOVIEMBRE",25,2,"Estrategias y soluciones en gestión del riesgo",null,4]
[null,"TAREAS DE ALTO RIESGO ","Curso tareas de alto riesgo. Módulo 1: Seguridad eléctrica  ","Personal responsable del sistema de gestión, líderes de proceso, copasst. ","PRESENCIAL ","MEDELLÍN ","8:00 a.m. - 12:00 m","2019-03-19","Carrera 43A No 19-17, auditorio piso 4 torre norte Block Empresarial","GPS CIUDAD","MARZO",40,4,null,null,4]
[null,"TAREAS DE ALTO RIESGO ","Curso tareas de alto riesgo. Módulo 2: Operación segura de maquinaria ","Personal responsable del sistema de gestión, líderes de proceso, copasst. ","PRESENCIAL ","MEDELLÍN ","8:00 a.m. - 12:00 m","2019-07-16","Carrera 43A No 19-17, auditorio piso 4 torre norte Block Empresarial","GPS CIUDAD","JULIO",40,4,"Codess (Diego Agudelo)",null,4]
[null,"TAREAS DE ALTO RIESGO ","Curso tareas de alto riesgo. Módulo 3: Espacio confinado y atmósferas peligrosas.   Seguridad en excavaciones.  ","Personal responsable del sistema de gestión, líderes de proceso, copasst. ","PRESENCIAL ","MEDELLÍN ","8:00 a.m. - 12:00 m","2019-09-04","Carrera 43A No 19-17, auditorio piso 4 torre norte Block Empresarial","GPS CIUDAD","SEPTIEMBRE",40,4,"MG MASTER GROUP SAS",null,4]
[null,"TAREAS DE ALTO RIESGO ","Curso tareas de alto riesgo. Módulo 4: Elaboración de procedimientos seguros, Análisis de tareas seguras y permisos de trabajo. ","Personal responsable del sistema de gestión, líderes de proceso, copasst. ","PRESENCIAL ","MEDELLÍN ","8:00 a.m. - 12:00 m","2019-10-24","Carrera 43A No 19-17, auditorio piso 4 torre norte Block Empresarial","GPS CIUDAD","OCTUBRE",40,4,"Codess (Diego Agudelo)",null,4]
[null,"GESTIÓN EFECTIVA DEL COMITÉ PARITARIO DE SALUD OCUPACIONAL COPASST","Capacitación copasst   (Inspecciones de seguridad, Investigación accidentes de trabajo, Elementos de Protección Personal, Hábitos saludables, primeros auxilios, Liderazo). Conozca más sobre la Herramienta de Excel CIL copasst Interactivo. ","Dirigida a los Comités Paritarios de Salud Ocupacional. ","VIRTUAL ","NACIONAL","Abierto ",{"$f":"+IF(O55>=TODAY(),O55,TODAY()+2)","v":"2019-10-31"},"Liberty University","PYP ","OCTUBRE","Abierto",200,null,"2019-01-01",8]
[null,"SISTEMA DE GESTIÓN SEGURIDAD Y SALUD EN EL TRABAJO SST","Curso 50 Horas Sistema de gestión de seguridad y salud en el trabajo ","Responsable del sistema de gestión, copasst y todas los cargos que rinden cuentas en el sistema de gestión de seguridad y salud en el trabajo).","VIRTUAL ","NACIONAL","Abierto ",{"$f":"+IF(O56>=TODAY(),O56,TODAY()+2)","v":"2019-10-31"},"Liberty University","PYP ","OCTUBRE","Abierto",200,null,"2019-01-01",50]
[null,"SISTEMA DE GESTIÓN SEGURIDAD Y SALUD EN EL TRABAJO SST","Resolución 0312 de 2019 Estándares Mínimos del Sistema de Gestión de Seguridad y Salud en el Trabajo.","Responsable del sistema de gestión, copasst y todas los cargos que rinden cuentas en el sistema de gestión de seguridad y salud en el trabajo).","VIRTUAL ","NACIONAL","2:00 p.m. 4:00 p.m.","2019-03-27","Liberty University","PYP ","MARZO","Abierto",200,null,null,2]
[null,"SISTEMA DE GESTIÓN SEGURIDAD Y SALUD EN EL TRABAJO SST","Curso certificado sistema de gestión.  En qué fase está mi empresa con respecto al cumplimiento de las fases dadas por el ministerio?. Modulo 1 . Evaluación estándares mínimos y componentes del SG - SST y Fase Planear. ","Responsable del sistema de gestión, copasst y todas los cargos que rinden cuentas en el sistema de gestión de seguridad y salud en el trabajo).","PRESENCIAL ","BOGOTÁ","8:00 a.m. - 12:00 m","2019-02-07","Calle 73 N° 10 - 83 Torre C Oficina 302. Salón 302 Fucsia","ESPECIALISTA P Y P ","FEBRERO",40,2,"Montajes y procesos mgonzalez@montajesyprocesos.com",null,4]
[null,"SISTEMA DE GESTIÓN SEGURIDAD Y SALUD EN EL TRABAJO SST","Curso certificado sistema de gestión.  En qué fase está mi empresa con respecto al cumplimiento de las fases dadas por el ministerio?. Modulo 2 . Fase Hacer y  Verificar. Requisito módulo 1.","Responsable del sistema de gestión, copasst y todas los cargos que rinden cuentas en el sistema de gestión de seguridad y salud en el trabajo).","PRESENCIAL ","BOGOTÁ","8:00 a.m. - 12:00 m","2019-03-14","Calle 73 N° 10 - 83 Torre C Oficina 302. Salón 302 Fucsia","ESPECIALISTA P Y P ","MARZO",40,2,null,null,4]
[null,"SISTEMA DE GESTIÓN SEGURIDAD Y SALUD EN EL TRABAJO SST","Curso certificado sistema de gestión.  Fases estándares mínimos. En qué fase está mi empresa con respecto al cumplimiento de las fases dadas por el ministerio?. Modulo 3. Fase Actuar y seguimiento plan de mejora.  Requisito modulo 1 y 2.","Responsable del sistema de gestión, copasst y todas los cargos que rinden cuentas en el sistema de gestión de seguridad y salud en el trabajo).","PRESENCIAL ","BOGOTÁ","8:00 a.m. - 12:00 m","2019-04-25","Calle 73 N° 10 - 83 Torre C Oficina 302. Salón 302 Fucsia","ESPECIALISTA P Y P ","ABRIL",40,2,null,null,4]
[null,"SISTEMA DE GESTIÓN SEGURIDAD Y SALUD EN EL TRABAJO SST","Curso certificado sistema de gestión.  Fases estándares mínimos. En qué fase está mi empresa con respecto al cumplimiento de las fases dadas por el ministerio?. Modulo 4: Inspección, vigilancia y control.   Fase de verificación Ministerio de trabajo. Requisito módulo 1, 2 y 3","Responsable del sistema de gestión, copasst y todas los cargos que rinden cuentas en el sistema de gestión de seguridad y salud en el trabajo).","PRESENCIAL ","BOGOTÁ","8:00 a.m. - 12:00 m","2019-05-09","Calle 73 N° 10 - 83 Torre C Oficina 302. Salón 302 Fucsia","ESPECIALISTA P Y P ","MAYO",40,2,null,null,4]
[null,"SISTEMA DE GESTIÓN SEGURIDAD Y SALUD EN EL TRABAJO SST","Curso certificado sistema de gestión.  En qué fase está mi empresa con respecto al cumplimiento de las fases dadas por el ministerio?. Modulo 1 . Evaluación estándares mínimos y componentes del SG - SST y Fase Planear. ","Responsable del sistema de gestión, copasst y todas los cargos que rinden cuentas en el sistema de gestión de seguridad y salud en el trabajo).","PRESENCIAL ","BOGOTÁ","8:00 a.m. - 12:00 m","2019-07-04","Calle 73 N° 10 - 83 Torre C Oficina 302. Salón 302 Fucsia","ESPECIALISTA P Y P ","JULIO",40,2,null,null,4]
[null,"SISTEMA DE GESTIÓN SEGURIDAD Y SALUD EN EL TRABAJO SST","Curso certificado sistema de gestión.  En qué fase está mi empresa con respecto al cumplimiento de las fases dadas por el ministerio?. Modulo 2 . Fase Hacer y  Verificar. Requisito módulo 1.","Responsable del sistema de gestión, copasst y todas los cargos que rinden cuentas en el sistema de gestión de seguridad y salud en el trabajo).","PRESENCIAL ","BOGOTÁ","8:00 a.m. - 12:00 m","2019-08-08","Calle 73 N° 10 - 83 Torre C Oficina 302. Salón 302 Fucsia","ESPECIALISTA P Y P ",{"$f":"UPPER(TEXT(H63,\"mmmm\"))","v":"AGOSTO"},40,2,null,null,4]
[null,"SISTEMA DE GESTIÓN SEGURIDAD Y SALUD EN EL TRABAJO SST","Curso certificado sistema de gestión.  Fases estándares mínimos. En qué fase está mi empresa con respecto al cumplimiento de las fases dadas por el ministerio?. Modulo 3. Fase Actuar y seguimiento plan de mejora.  Requisito modulo 1 y 2.","Responsable del sistema de gestión, copasst y todas los cargos que rinden cuentas en el sistema de gestión de seguridad y salud en el trabajo).","PRESENCIAL ","BOGOTÁ","8:00 a.m. - 12:00 m","2019-09-12","Calle 73 N° 10 - 83 Torre C Oficina 302. Salón 302 Fucsia","ESPECIALISTA P Y P ","SEPTIEMBRE",40,2,null,null,4]
[null,"SISTEMA DE GESTIÓN SEGURIDAD Y SALUD EN EL TRABAJO SST","Curso certificado sistema de gestión.  Fases estándares mínimos. En qué fase está mi empresa con respecto al cumplimiento de las fases dadas por el ministerio?. Modulo 4: Inspección, vigilancia y control.  ","Responsable del sistema de gestión, copasst y todas los cargos que rinden cuentas en el sistema de gestión de seguridad y salud en el trabajo).","PRESENCIAL ","BOGOTÁ","8:00 a.m. - 12:00 m","2019-10-10","Calle 73 N° 10 - 83 Torre C Oficina 302. Salón 302 Fucsia","ESPECIALISTA P Y P ","OCTUBRE",40,2,null,null,4]
[null,"SISTEMA DE GESTIÓN SEGURIDAD Y SALUD EN EL TRABAJO SST","SG SST.  Curso de auditoria SG SST","Responsable del sistema de gestión, copasst y todas los cargos que rinden cuentas en el sistema de gestión de seguridad y salud en el trabajo).","PRESENCIAL ","BARRANCABERMEJA","8:00 a.m. - 12:00 m","2019-05-30","Hotel San Silvestre Cra 19 # 58a–13","GPS CIUDAD","MAYO",25,2,null,null,4]
[null,"SISTEMA DE GESTIÓN SEGURIDAD Y SALUD EN EL TRABAJO SST","Curso certificado sistema de gestión.  En qué fase está mi empresa con respecto al cumplimiento de las fases dadas por el ministerio?. Modulo 1 . Evaluación estándares mínimos y componentes del SG - SST y Fase Planear. ","Responsable del sistema de gestión, copasst y todas los cargos que rinden cuentas en el sistema de gestión de seguridad y salud en el trabajo).","PRESENCIAL ","BARRANQUILLA","8:00 a.m. - 12:00 m","2019-03-28","Liberty Seguros Calle 77 No 59-35 Barranquilla","GPS CIUDAD","MARZO",25,3,null,null,4]
[null,"SISTEMA DE GESTIÓN SEGURIDAD Y SALUD EN EL TRABAJO SST","Curso certificado sistema de gestión.  En qué fase está mi empresa con respecto al cumplimiento de las fases dadas por el ministerio?. Modulo 2 . Fase Hacer y  Verificar. Requisito módulo 1.","Responsable del sistema de gestión, copasst y todas los cargos que rinden cuentas en el sistema de gestión de seguridad y salud en el trabajo).","PRESENCIAL ","BARRANQUILLA","8:00 a.m. - 12:00 m","2019-04-11","ICONTEC Cra 57 No. 70-89 Barranquilla","GPS CIUDAD","ABRIL",25,3,null,null,4]
[null,"SISTEMA DE GESTIÓN SEGURIDAD Y SALUD EN EL TRABAJO SST","Curso certificado sistema de gestión.  Fases estándares mínimos. En qué fase está mi empresa con respecto al cumplimiento de las fases dadas por el ministerio?. Modulo 3. Fase Actuar y seguimiento plan de mejora.  Requisito modulo 1 y 2.","Responsable del sistema de gestión, copasst y todas los cargos que rinden cuentas en el sistema de gestión de seguridad y salud en el trabajo).","PRESENCIAL ","BARRANQUILLA","8:00 a.m. - 12:00 m","2019-04-25","ICONTEC Cra 57 No. 70-89 Barranquilla","GPS CIUDAD","ABRIL",25,3,null,null,4]
[null,"SISTEMA DE GESTIÓN SEGURIDAD Y SALUD EN EL TRABAJO SST","Curso certificado sistema de gestión.  Fases estándares mínimos. En qué fase está mi empresa con respecto al cumplimiento de las fases dadas por el ministerio?. Modulo 4: Inspección, vigilancia y control.   Fase de verificación Ministerio de trabajo. ","Responsable del sistema de gestión, copasst y todas los cargos que rinden cuentas en el sistema de gestión de seguridad y salud en el trabajo).","PRESENCIAL ","BARRANQUILLA","8:00 a.m. - 12:00 m","2019-05-09","ICONTEC Cra 57 No. 70-89 Barranquilla","GPS CIUDAD","MAYO",25,3,null,null,4]
[null,"SISTEMA DE GESTIÓN SEGURIDAD Y SALUD EN EL TRABAJO SST","Curso certificado sistema de gestión.  En qué fase está mi empresa con respecto al cumplimiento de las fases dadas por el ministerio?. Modulo 1 . Evaluación estándares mínimos y componentes del SG - SST y Fase Planear. ","Responsable del sistema de gestión, copasst y todas los cargos que rinden cuentas en el sistema de gestión de seguridad y salud en el trabajo).","PRESENCIAL ","BUCARAMANGA","8:00 a.m. - 12:00 m","2019-02-21","Hotel La Triada Cra. 20 #34--22","GPS CIUDAD","FEBRERO",25,2,null,null,4]
[null,"SISTEMA DE GESTIÓN SEGURIDAD Y SALUD EN EL TRABAJO SST","Curso certificado sistema de gestión.  En qué fase está mi empresa con respecto al cumplimiento de las fases dadas por el ministerio?. Modulo 2 . Fase Hacer y  Verificar. Requisito módulo 1.","Responsable del sistema de gestión, copasst y todas los cargos que rinden cuentas en el sistema de gestión de seguridad y salud en el trabajo).","PRESENCIAL ","BUCARAMANGA","8:00 a.m. - 12:00 m","2019-03-14","Hotel La Triada Cra. 20 #34--22","GPS CIUDAD","MARZO",25,2,null,null,4]
[null,"SISTEMA DE GESTIÓN SEGURIDAD Y SALUD EN EL TRABAJO SST","Curso certificado sistema de gestión.  Fases estándares mínimos. En qué fase está mi empresa con respecto al cumplimiento de las fases dadas por el ministerio?. Modulo 3. Fase Actuar y seguimiento plan de mejora.  Requisito modulo 1 y 2.","Responsable del sistema de gestión, copasst y todas los cargos que rinden cuentas en el sistema de gestión de seguridad y salud en el trabajo).","PRESENCIAL ","BUCARAMANGA","8:00 a.m. - 12:00 m","2019-04-24","Hotel La Triada Cra. 20 #34--22","GPS CIUDAD","ABRIL",25,2,null,null,4]
[null,"SISTEMA DE GESTIÓN SEGURIDAD Y SALUD EN EL TRABAJO SST","Curso certificado sistema de gestión.  Fases estándares mínimos. En qué fase está mi empresa con respecto al cumplimiento de las fases dadas por el ministerio?. Modulo 4: Inspección, vigilancia y control.   Fase de verificación Ministerio de trabajo. Requisito módulo 1, 2 y 3","Responsable del sistema de gestión, copasst y todas los cargos que rinden cuentas en el sistema de gestión de seguridad y salud en el trabajo).","PRESENCIAL ","BUCARAMANGA","8:00 a.m. - 12:00 m","2019-05-08","Hotel La Triada Cra. 20 #34--22","GPS CIUDAD","MAYO",25,2,null,null,4]
[null,"SISTEMA DE GESTIÓN SEGURIDAD Y SALUD EN EL TRABAJO SST","Curso certificado sistema de gestión.  En qué fase está mi empresa con respecto al cumplimiento de las fases dadas por el ministerio?. Modulo 1 . Evaluación estándares mínimos y componentes del SG - SST y Fase Planear. ","Responsable del sistema de gestión, copasst y todas los cargos que rinden cuentas en el sistema de gestión de seguridad y salud en el trabajo).","PRESENCIAL ","CALI","8:00 a.m. - 12:00 m","2019-03-20","Av. 5 Norte # 38N-81","GPS CIUDAD","MARZO",30,2,"SAFE SAS",null,4]
[null,"SISTEMA DE GESTIÓN SEGURIDAD Y SALUD EN EL TRABAJO SST","Curso certificado sistema de gestión.  En qué fase está mi empresa con respecto al cumplimiento de las fases dadas por el ministerio?. Modulo 2 . Fase Hacer y  Verificar. Requisito módulo 1.","Responsable del sistema de gestión, copasst y todas los cargos que rinden cuentas en el sistema de gestión de seguridad y salud en el trabajo).","PRESENCIAL ","CALI","8:00 a.m. - 12:00 m","2019-03-28","Av. 5 Norte # 38N-81","GPS CIUDAD","MARZO",30,2,"SAFE SAS",null,4]
[null,"SISTEMA DE GESTIÓN SEGURIDAD Y SALUD EN EL TRABAJO SST","Curso certificado sistema de gestión.  Fases estándares mínimos. En qué fase está mi empresa con respecto al cumplimiento de las fases dadas por el ministerio?. Modulo 3. Fase Actuar y seguimiento plan de mejora.  Requisito modulo 1 y 2.","Responsable del sistema de gestión, copasst y todas los cargos que rinden cuentas en el sistema de gestión de seguridad y salud en el trabajo).","PRESENCIAL ","CALI","8:00 a.m. - 12:00 m","2019-04-25","Av. 5 Norte # 38N-81","GPS CIUDAD","ABRIL",30,2,"SAFE SAS",null,4]
[null,"SISTEMA DE GESTIÓN SEGURIDAD Y SALUD EN EL TRABAJO SST","Curso certificado sistema de gestión.  Fases estándares mínimos. En qué fase está mi empresa con respecto al cumplimiento de las fases dadas por el ministerio?. Modulo 4: Inspección, vigilancia y control.   Fase de verificación Ministerio de trabajo. Requisito módulo 1, 2 y 3","Responsable del sistema de gestión, copasst y todas los cargos que rinden cuentas en el sistema de gestión de seguridad y salud en el trabajo).","PRESENCIAL ","CALI","8:00 a.m. - 12:00 m","2019-05-09","Av. 5 Norte # 38N-81","GPS CIUDAD","MAYO",30,2,"SAFE SAS",null,4]
[null,"SISTEMA DE GESTIÓN SEGURIDAD Y SALUD EN EL TRABAJO SST","Curso certificado sistema de gestión.  En qué fase está mi empresa con respecto al cumplimiento de las fases dadas por el ministerio?. Modulo 1 . Evaluación estándares mínimos y componentes del SG - SST y Fase Planear. ","Responsable del sistema de gestión, copasst y todas los cargos que rinden cuentas en el sistema de gestión de seguridad y salud en el trabajo).","PRESENCIAL ","CARTAGENA","8:00 a.m. - 12:00 m","2019-02-07","Liberty Seguros, Calle del Arsenal No 8B-195 piso 1","GPS CIUDAD","FEBRERO",25,2,"Gestión Interriesgos",null,4]
[null,"SISTEMA DE GESTIÓN SEGURIDAD Y SALUD EN EL TRABAJO SST","Curso certificado sistema de gestión.  En qué fase está mi empresa con respecto al cumplimiento de las fases dadas por el ministerio?. Modulo 2 . Fase Hacer y  Verificar. Requisito módulo 1.","Responsable del sistema de gestión, copasst y todas los cargos que rinden cuentas en el sistema de gestión de seguridad y salud en el trabajo).","PRESENCIAL ","CARTAGENA","8:00 a.m. - 12:00 m","2019-03-14","Liberty Seguros, Calle del Arsenal No 8B-195 piso 1","GPS CIUDAD","MARZO",25,2,"Gestión Interriesgos",null,4]
[null,"SISTEMA DE GESTIÓN SEGURIDAD Y SALUD EN EL TRABAJO SST","Curso certificado sistema de gestión.  Fases estándares mínimos. En qué fase está mi empresa con respecto al cumplimiento de las fases dadas por el ministerio?. Modulo 3. Fase Actuar y seguimiento plan de mejora.  Requisito modulo 1 y 2.","Responsable del sistema de gestión, copasst y todas los cargos que rinden cuentas en el sistema de gestión de seguridad y salud en el trabajo).","PRESENCIAL ","CARTAGENA","8:00 a.m. - 12:00 m","2019-04-25","Liberty Seguros, Calle del Arsenal No 8B-195 piso 1","GPS CIUDAD","ABRIL",25,2,"Gestión Interriesgos",null,4]
[null,"SISTEMA DE GESTIÓN SEGURIDAD Y SALUD EN EL TRABAJO SST","Curso certificado sistema de gestión.  Fases estándares mínimos. En qué fase está mi empresa con respecto al cumplimiento de las fases dadas por el ministerio?. Modulo 4: Inspección, vigilancia y control.   Fase de verificación Ministerio de trabajo. Requisito módulo 1, 2 y 3","Responsable del sistema de gestión, copasst y todas los cargos que rinden cuentas en el sistema de gestión de seguridad y salud en el trabajo).","PRESENCIAL ","CARTAGENA","8:00 a.m. - 12:00 m","2019-05-09","Liberty Seguros, Calle del Arsenal No 8B-195 piso 1","GPS CIUDAD","MAYO",25,2,"Gestión Interriesgos",null,4]
[null,"SISTEMA DE GESTIÓN SEGURIDAD Y SALUD EN EL TRABAJO SST","Curso certificado sistema de gestión.  En qué fase está mi empresa con respecto al cumplimiento de las fases dadas por el ministerio?. Modulo 1 . Evaluación estándares mínimos y componentes del SG - SST y Fase Planear. ","Responsable del sistema de gestión, copasst y todas los cargos que rinden cuentas en el sistema de gestión de seguridad y salud en el trabajo).","PRESENCIAL ","MEDELLÍN ","8:00 a.m. - 12:00 m","2019-03-06","Carrera 43A No 19-17, auditorio piso 4 torre norte Block Empresarial","GPS CIUDAD","MARZO",40,4,"RIGS SAS  ",null,4]
[null,"SISTEMA DE GESTIÓN SEGURIDAD Y SALUD EN EL TRABAJO SST","Curso certificado sistema de gestión.  En qué fase está mi empresa con respecto al cumplimiento de las fases dadas por el ministerio?. Modulo 2 . Fase Hacer y  Verificar. Requisito módulo 1.","Responsable del sistema de gestión, copasst y todas los cargos que rinden cuentas en el sistema de gestión de seguridad y salud en el trabajo).","PRESENCIAL ","MEDELLÍN ","8:00 a.m. - 12:00 m","2019-05-08","Carrera 43A No 19-17, auditorio piso 4 torre norte Block Empresarial","GPS CIUDAD","MAYO",40,4,"RIGS SAS  ",null,4]
[null,"SISTEMA DE GESTIÓN SEGURIDAD Y SALUD EN EL TRABAJO SST","Curso certificado sistema de gestión.  Fases estándares mínimos. En qué fase está mi empresa con respecto al cumplimiento de las fases dadas por el ministerio?. Modulo 3. Fase Actuar y seguimiento plan de mejora.  Requisito modulo 1 y 2.","Responsable del sistema de gestión, copasst y todas los cargos que rinden cuentas en el sistema de gestión de seguridad y salud en el trabajo).","PRESENCIAL ","MEDELLÍN ","8:00 a.m. - 12:00 m","2019-06-18","Carrera 43A No 19-17, auditorio piso 4 torre norte Block Empresarial","GPS CIUDAD","JUNIO",40,4,"RIGS SAS  ",null,4]
[null,"SISTEMA DE GESTIÓN SEGURIDAD Y SALUD EN EL TRABAJO SST","Curso certificado sistema de gestión.  Fases estándares mínimos. En qué fase está mi empresa con respecto al cumplimiento de las fases dadas por el ministerio?. Modulo 4: Inspección, vigilancia y control.   Fase de verificación Ministerio de trabajo. Requisito módulo 1, 2 y 3","Responsable del sistema de gestión, copasst y todas los cargos que rinden cuentas en el sistema de gestión de seguridad y salud en el trabajo).","PRESENCIAL ","MEDELLÍN ","8:00 a.m. - 12:00 m","2019-08-14","Carrera 43A No 19-17, auditorio piso 4 torre norte Block Empresarial","GPS CIUDAD","AGOSTO",40,4,"RIGS SAS  ",null,4]
[null,"SISTEMA DE GESTIÓN SEGURIDAD Y SALUD EN EL TRABAJO SST","SG SST.  Curso de auditoria SG SST","Responsable del sistema de gestión, copasst y todas los cargos que rinden cuentas en el sistema de gestión de seguridad y salud en el trabajo).","VIRTUAL ","NACIONAL","2:00 p.m. a 5:00 p.m.","2019-05-10","Liberty University","ESPECIALISTA P Y P ","MAYO","Abierto",200,"Montajes y procesos mgonzalez@montajesyprocesos.com","2019-05-10",6]
[null,"SISTEMA DE GESTIÓN SEGURIDAD Y SALUD EN EL TRABAJO SST","Sistema de gestion de seguridad y salud en el trabajo, enfocado hacia el plan de trabajo y fase de verificación del ministerio de trabajo.  ","Responsable del sistema de gestión, copasst y todas los cargos que rinden cuentas en el sistema de gestión de seguridad y salud en el trabajo).","PRESENCIAL ","PEREIRA","8:00 a.m. - 12:00 m","2019-03-07","Previo a la actividad se estará confirmando lugar del evento ","GPS CIUDAD","MARZO",25,2,null,null,4]
[null,"SISTEMA DE GESTIÓN SEGURIDAD Y SALUD EN EL TRABAJO SST","Sistema de gestion de seguridad y salud en el trabajo, enfocado hacia el plan de trabajo y fase de verificación del ministerio de trabajo.  ","Responsable del sistema de gestión, copasst y todas los cargos que rinden cuentas en el sistema de gestión de seguridad y salud en el trabajo).","PRESENCIAL ","TUNJA","8:00 a.m. - 12:00 m","2019-03-07","Previo a la actividad se estará confirmando lugar del evento ","ESPECIALISTA P Y P ","MARZO",25,2,null,null,4]
[null,"SISTEMA DE GESTIÓN SEGURIDAD Y SALUD EN EL TRABAJO SST","Sistema de gestion de seguridad y salud en el trabajo, enfocado hacia el plan de trabajo y fase de verificación del ministerio de trabajo.  ","Responsable del sistema de gestión, copasst y todas los cargos que rinden cuentas en el sistema de gestión de seguridad y salud en el trabajo).","PRESENCIAL ","SOGAMOSO ","8:00 a.m. - 12:00 m","2019-03-07","Previo a la actividad se estará confirmando lugar del evento ","ESPECIALISTA P Y P ","MARZO",25,2,null,null,4]
[null,"SISTEMA DE GESTIÓN SEGURIDAD Y SALUD EN EL TRABAJO SST","Sistema de gestion de seguridad y salud en el trabajo, enfocado hacia el plan de trabajo y fase de verificación del ministerio de trabajo.  ","Responsable del sistema de gestión, copasst y todas los cargos que rinden cuentas en el sistema de gestión de seguridad y salud en el trabajo).","PRESENCIAL ","VILLAVICENCIO","8:00 a.m. - 12:00 m","2019-03-07","Previo a la actividad se estará confirmando lugar del evento ","ESPECIALISTA P Y P ","MARZO",25,2,null,null,4]
[null,"SISTEMA DE GESTIÓN SEGURIDAD Y SALUD EN EL TRABAJO SST","Actualización legal en SGSST","Responsable del sistema de gestión, copasst y todas los cargos que rinden cuentas en el sistema de gestión de seguridad y salud en el trabajo).","PRESENCIAL ","PEREIRA","8:00 a.m. - 12:00 m","2019-08-15","Previo a la actividad se estará confirmando lugar del evento ","GPS CIUDAD","AGOSTO",25,2,null,null,4]
[null,"SISTEMA DE GESTIÓN SEGURIDAD Y SALUD EN EL TRABAJO SST","Actualización legal en SGSST","Responsable del sistema de gestión, copasst y todas los cargos que rinden cuentas en el sistema de gestión de seguridad y salud en el trabajo).","PRESENCIAL ","TUNJA","8:00 a.m. - 12:00 m","2019-08-15","Previo a la actividad se estará confirmando lugar del evento ","ESPECIALISTA P Y P ","AGOSTO",25,2,null,null,4]
[null,"SISTEMA DE GESTIÓN SEGURIDAD Y SALUD EN EL TRABAJO SST","Actualización legal en SGSST","Responsable del sistema de gestión, copasst y todas los cargos que rinden cuentas en el sistema de gestión de seguridad y salud en el trabajo).","PRESENCIAL ","SOGAMOSO ","8:00 a.m. - 12:00 m","2019-08-15","Previo a la actividad se estará confirmando lugar del evento ","ESPECIALISTA P Y P ","AGOSTO",25,2,null,null,4]
[null,"SISTEMA DE GESTIÓN SEGURIDAD Y SALUD EN EL TRABAJO SST","Actualización legal en SGSST","Responsable del sistema de gestión, copasst y todas los cargos que rinden cuentas en el sistema de gestión de seguridad y salud en el trabajo).","PRESENCIAL ","VILLAVICENCIO","8:00 a.m. - 12:00 m","2019-08-15","Previo a la actividad se estará confirmando lugar del evento ","ESPECIALISTA P Y P ",{"$f":"UPPER(TEXT(H95,\"mmmm\"))","v":"AGOSTO"},25,2,null,null,4]
[null,"SISTEMA DE GESTIÓN SEGURIDAD Y SALUD EN EL TRABAJO SST","Resolución 0312 de 2019 Estándares Mínimos del Sistema de Gestión de Seguridad y Salud en el Trabajo.","Responsable del sistema de gestión, copasst y todas los cargos que rinden cuentas en el sistema de gestión de seguridad y salud en el trabajo.","VIRTUAL ","NACIONAL","2:00 a 5:00 p.m.","2019-03-27","Liberty University","PYP","MARZO",200,2,null,null,0]
[null,"RIESGO PSICOSOCIAL ","Programa de gestión riesgo psicosocial (Aula viviendo en armonía).","Personal responsable del sistema de gestión, Talento humano y comité de convivencia. ","VIRTUAL ","NACIONAL","Abierto",{"$f":"+IF(O97>=TODAY(),O97,TODAY()+2)","v":"2019-10-31"},"Liberty University","PYP ","OCTUBRE","Abierto",200,null,"2019-03-01",6]
[null,"RIESGO PSICOSOCIAL ","Manejo de emociones y salud integral","Trabajadores afiliados a Liberty","VIRTUAL ","NACIONAL","2:30 p.m. - 4:30 p.m.","2019-10-29","Liberty University","SANDRA QUINTERO ","OCTUBRE","Abierto",200,null,"2019-04-01",2]
[null,"RIESGO PSICOSOCIAL ","Familia saludable, trabajador sano. (Aula viviendo en armonía).","Trabajadores afiliados a Liberty","VIRTUAL ","NACIONAL","Abierto",{"$f":"+IF(O99>=TODAY(),O99,TODAY()+2)","v":"2019-10-31"},"Liberty University","SANDRA QUINTERO ","OCTUBRE","Abierto",200,null,"2019-03-01",2]
[null,"ACOSO LABORAL ","Acoso Laboral (Aula viviendo en armonía).","Trabajadores afiliados a Liberty","VIRTUAL ","NACIONAL","Abierto",{"$f":"+IF(O100>=TODAY(),O100,TODAY()+2)","v":"2019-10-31"},"Liberty University",null,{"$f":"UPPER(TEXT(H100,\"mmmm\"))","v":"OCTUBRE"},"Abierto",200,null,null,2]
[null,"RIESGO PSICOSOCIAL ","Programa de gestión riesgo psicosocial ","Personal responsable del sistema de gestión, Talento humano y comité de convivencia. ","PRESENCIAL ","MEDELLÍN ","8:00 am - 10:00 a.m.","2019-06-07","Carrera 43A No 19-17, auditorio piso 4 torre norte Block Empresarial","GPS CIUDAD","JUNIO",40,4,"RIGS SAS  ",null,2]
[null,"PROGRAMA DE GESTIÓN RIESGO QUÍMICO","Programa de gestión de riesgo químico y sistema globalmente armonizado ","Personal responsable del sistema de gestión de seguridad y salud en el trabajo y/o personal de compras - producción ","PRESENCIAL ","BOGOTÁ","8:00 a.m. - 12:00 m","2019-02-21","Calle 73 N° 10 - 83 Torre C Oficina 302. Salón 302 Fucsia","PYP ","FEBRERO",40,2,"Gestión Interriesgos",null,4]
[null,"PROGRAMA DE GESTIÓN RIESGO QUÍMICO","Programa de gestión de riesgo químico y sistema globalmente armonizado ","Personal responsable del sistema de gestión de seguridad y salud en el trabajo y/o personal de compras - producción ","PRESENCIAL ","MEDELLÍN ","8:00 a.m. - 12:00 m","2019-04-24","Carrera 43A No 19-17, auditorio piso 4 torre norte Block Empresarial","GPS CIUDAD","ABRIL",40,4,"RIGS SAS  ",null,4]
[null,"PROGRAMA DE GESTIÓN RIESGO QUÍMICO","Programa de gestión de riesgo químico y sistema globalmente armonizado ","Personal responsable del sistema de gestión de seguridad y salud en el trabajo y/o personal de compras - producción ","VIRTUAL ","NACIONAL","2:00 p.m. - 5:00 p.m.","2019-03-01","Liberty University","PYP ","MARZO","Abierto",200,"Gestión Interriesgos","2019-03-01",4]
[null,"PROGRAMA DE GESTIÓN RIESGO QUÍMICO","Programa de gestión de riesgo químico y sistema globalmente armonizado ","Personal responsable del sistema de gestión de seguridad y salud en el trabajo y/o personal de compras - producción ","PRESENCIAL ","CALI","8:00 a.m. - 12:00 m","2019-02-21","Av. 5 Norte # 38N-81","GPS CIUDAD","FEBRERO",30,2,"SAFE SAS",null,4]
[null,"PROGRAMA DE GESTIÓN RIESGO QUÍMICO","Programa de gestión de riesgo químico y sistema globalmente armonizado ","Personal responsable del sistema de gestión de seguridad y salud en el trabajo y/o personal de compras - producción ","PRESENCIAL ","BARRANCABERMEJA","8:00 a.m. - 12:00 m","2019-02-21","Cra 12 No 49a -18 Barrio Colombia. ","GPS CIUDAD","FEBRERO",25,2,null,null,4]
[null,"PROGRAMA DE GESTIÓN RIESGO QUÍMICO","Programa de gestión de riesgo químico y sistema globalmente armonizado ","Personal responsable del sistema de gestión de seguridad y salud en el trabajo y/o personal de compras - producción ","PRESENCIAL ","BUCARAMANGA","8:00 a.m. - 12:00 m","2019-06-06","Hotel La Triada Cra. 20 #34--22","GPS CIUDAD","JUNIO",25,2,null,null,4]
[null,"PROGRAMA DE GESTIÓN RIESGO QUÍMICO","Programa de gestión de riesgo químico y sistema globalmente armonizado ","Personal responsable del sistema de gestión de seguridad y salud en el trabajo y/o personal de compras - producción ","PRESENCIAL ","BARRANQUILLA","8:00 a.m. - 12:00 m","2019-11-07","ICONTEC Cra 57 No. 70-89 Barranquilla","GPS CIUDAD","NOVIEMBRE",25,3,null,null,4]
[null,"PREVENCIÓN DE CONSUMO DE SUSTANCIAS PSICOACTIVAS. SIN ADICCIÓN ME QUIERO MÁS. ","Capacitación sobre herramientas de  prevención  en el consumo de alcohol y sustancias psicoactivas en el ámbito laboral.  Programa Sin adicción me quiero más de ARL Liberty. ","Los participantes deben estar afiliados a la ARL LIBERTY  y  tener a cargo el Sistema de Gestión de Seguridad y Salud en el Trabajo o pertenecer al área de Recursos Humanos","VIRTUAL ","NACIONAL","Abierto ",{"$f":"+IF(O109>=TODAY(),O109,TODAY()+2)","v":"2019-10-31"},"Liberty University",null,"OCTUBRE","Abierto",200,null,"2019-03-01",4]
[null,"PLAN ESTRATÉGICO DE SEGURIDAD VIAL. PESV","Curso de Seguridad Vial – Embajadores por la seguridad vial.","Los participantes deben estar afiliados a ARL Liberty y tener a cargo el SG-SST","VIRTUAL ","NACIONAL","Abierto ",{"$f":"+IF(O110>=TODAY(),O110,TODAY()+2)","v":"2019-10-31"},"Liberty University","PYP ","OCTUBRE","Abierto",200,null,"2019-01-01",2]
[null,"PLAN ESTRATÉGICO DE SEGURIDAD VIAL. PESV","Plan Estratégico de Seguridad Vial: \nDónde deben estar las empresas en el PESV hoy? \nCambios en la noma.","Personal responsable del sistema de gestión de seguridad y salud en el trabajo y/o cargos que rinden cuentas del SG-SST. ","PRESENCIAL ","BOGOTÁ","8:00 - 12:00 P.M","2019-11-14","Calle 73 N° 10 - 83 Torre C Oficina 302. Salón 302 Fucsia","JAIRO FUQUEN ","NOVIEMBRE",25,2,null,null,8]
[null,"PLAN ESTRATÉGICO DE SEGURIDAD VIAL. PESV","Capacitación actores de la vía -  seguridad vial ","Priorizar por el personal que tiene exposición a riesgo vial ","PRESENCIAL ","BARRANQUILLA","8:00 a.m. - 12:00 m","2019-10-17","ICONTEC Cra 57 No. 70-89 Barranquilla","GPS CIUDAD","OCTUBRE",25,3,null,null,4]
[null,"PLAN ESTRATÉGICO DE SEGURIDAD VIAL. PESV","Capacitación actores de la vía -  seguridad vial ","Priorizar por el personal que tiene exposición a riesgo vial ","PRESENCIAL ","CALI","8:00 a.m. - 12:00 m","2019-05-23","Av. 5 Norte # 38N-81","GPS CIUDAD","MAYO",30,2,"SAFE SAS",null,4]
[null,"PLAN ESTRATÉGICO DE SEGURIDAD VIAL. PESV","Capacitación actores de la vía -  seguridad vial ","Priorizar por el personal que tiene exposición a riesgo vial ","PRESENCIAL ","BUCARAMANGA","8:00 a.m. - 12:00 m","2019-05-30","Hotel La Triada Cra. 20 #34--22","GPS CIUDAD","MAYO",25,2,null,null,4]
[null,"PLAN ESTRATÉGICO DE SEGURIDAD VIAL. PESV","Capacitación actores de la vía -  seguridad vial ","Priorizar por el personal que tiene exposición a riesgo vial ","PRESENCIAL ","MEDELLÍN ","8:00 a.m. - 12:00 m","2019-02-05","Carrera 43A No 19-17, auditorio piso 4 torre norte Block Empresarial","GPS CIUDAD","FEBRERO",40,4,"GRUPO RISK MANAGEMENT S.A.S.",null,4]
[null,"PLAN ESTRATÉGICO DE SEGURIDAD VIAL. PESV","Capacitación actores de la vía -  seguridad vial ","Priorizar por el personal que tiene exposición a riesgo vial ","PRESENCIAL ","CARTAGENA","8:00 a.m. - 12:00 m","2019-05-16","Liberty Seguros, Calle del Arsenal No 8B-195 piso 1","GPS CIUDAD","MAYO",25,2,"Gestión Interriesgos",null,4]
[null,"PLAN ESTRATÉGICO DE SEGURIDAD VIAL. PESV","Capacitación actores de la vía -  seguridad vial ","Priorizar por el personal que tiene exposición a riesgo vial ","PRESENCIAL ","BARRANCABERMEJA","8:00 a.m. - 12:00 m","2019-05-23","Hotel San Silvestre Cra 19 # 58a–13","GPS CIUDAD","MAYO",25,2,"Gestión Interriesgos",null,4]
[null,"PELIGRO MECANICO ","Curso Peligro Mecánico ","Personal con exposición a peligro por condición de seguridad dado por riesgo mecánico y responsable del SG-SST ","VIRTUAL ","NACIONAL","Abierto ",{"$f":"+IF(O118>=TODAY(),O118,TODAY()+2)","v":"2019-10-31"},"Liberty University","PYP ","OCTUBRE","Abierto",200,null,"2019-01-01",2]
[null,"MEJOR PREVENIR PARA GANAR","RCP: Reporte de condiciones peligrosas","Responsable del sistema de gestión, copasst y líderes.","VIRTUAL ","NACIONAL","Abierto ","2019-10-31","Liberty University","PYP ","OCTUBRE","Abierto",200,null,"2019-01-01",6]
[null,"MEJOR PREVENIR PARA GANAR","MVP: Gerenciando comportamientos vitales","Responsable del sistema de gestión, copasst y líderes.","VIRTUAL ","NACIONAL","Abierto ","2019-10-31","Liberty University","PYP ","OCTUBRE","Abierto",200,null,"2019-02-01",8]
[null,"MEJOR PREVENIR PARA GANAR","SMD: Sistema de manejo decisivo ","Responsable del sistema de gestión, copasst y líderes.","VIRTUAL ","NACIONAL","Abierto ","2019-10-31","Liberty University","PYP ","OCTUBRE","Abierto",200,null,"2019-01-01",4]
[null,"MEJOR PREVENIR PARA GANAR","Manos a la obra:  Programa de prevención de accidentes en manos","Responsable del sistema de gestión, copasst y líderes.","VIRTUAL ","NACIONAL","Abierto ","2019-10-31","Liberty University","PYP ","OCTUBRE","Abierto",200,null,"2019-01-01",2]
[null,"MEJOR PREVENIR PARA GANAR","Dejando Huella: Programa de prevención caídas a nivel ","Responsable del sistema de gestión, copasst y líderes.","VIRTUAL ","NACIONAL","Abierto ","2019-10-31","Liberty University","PYP ","OCTUBRE","Abierto",200,null,"2019-02-01",3]
[null,"MEJOR PREVENIR PARA GANAR","Programa Estrella: Programa de orden y aseo.","Responsable del sistema de gestión, copasst y líderes.","VIRTUAL ","NACIONAL","Abierto ","2019-10-31","Liberty University","PYP ","OCTUBRE","Abierto",200,null,"2019-02-01",4]
[null,"MEJOR PREVENIR PARA GANAR","O.S.M. Programa Operación Segura de Máquina.   ","Responsable del sistema de gestión, copasst y líderes.","VIRTUAL ","NACIONAL","Abierto ","2019-10-31","Liberty University","PYP","OCTUBRE","Abierto",200,null,"2019-02-01",4]
[null,"MEJOR PREVENIR PARA GANAR","Sistemas de Vigilancia Epidemiológica. ","Responsable del sistema de gestión, copasst y líderes.","VIRTUAL ","NACIONAL","Abierto","2019-10-31","Liberty University","PYP ","OCTUBRE","Abierto",200,null,"2019-03-01",6]
[null,"MEJOR PREVENIR PARA GANAR","Control de Fuentes de pérdida","Responsable del sistema de gestión, copasst y líderes.","VIRTUAL ","NACIONAL","Abierto","2019-10-31","Liberty University","PYP ","OCTUBRE","Abierto",200,null,"2019-03-01",4]
[null,"MANEJO SEGURO DE MONTACARGAS","Capacitación en manejo seguro de montacargas","Trabajadores que manejen montacargas dentro de su labor. ","VIRTUAL ","NACIONAL","2:00 a 4:00 p.m.","2018-05-24","Liberty University","PYP","MAYO","Abierto",200,null,"2019-05-09",4]
[null,"MANEJO SEGURO DE ESCALERAS","Curso sobre manejo seguro de escaleras ","Responsable del sistema de gestión, supervisores y trabajares.","VIRTUAL ","NACIONAL","2:00 - 4:00 p.m.","2019-04-10","Liberty University","PYP ","ABRIL","Abierto",200,null,null,2]
[null,"MEJOR PREVENIR PARA GANAR","AOSE Arquitectura de la excelencia en la seguridad ","Responsable del sistema de gestión. ","VIRTUAL ","NACIONAL","Abierto",{"$f":"+IF(O130>=TODAY(),O130,TODAY()+2)","v":"2019-10-31"},"Liberty University",null,"OCTUBRE","Abierto",200,null,null,2]
[null,"LIBERTY MUTUAL ","Construction Safety Tools - Just a Click Away","Requisito manejo del Inglés","VIRTUAL ","NACIONAL","2:00 - 3:00 p.m.","2019-02-07","LIBERTY MUTUAL",null,{"$f":"UPPER(TEXT(H131,\"mmmm\"))","v":"FEBRERO"},null,null,null,null,2]
[null,"LIBERTY MUTUAL ","Risk Control Services: A Virtual Overview","Requisito manejo del Inglés","VIRTUAL ","NACIONAL","2:00 - 3:00 p.m.","2019-03-05","LIBERTY MUTUAL",null,"MARZO",null,null,null,null,2]
[null,"LIBERTY MUTUAL ","Safe Patient/Resident Mobilization","Requisito manejo del Inglés","VIRTUAL ","NACIONAL","2:00 - 3:00 p.m.","2019-03-13","LIBERTY MUTUAL",null,"MARZO",null,null,null,null,2]
[null,"LIBERTY MUTUAL ","Silica: Competent Person and Control Plan Development","Requisito manejo del Inglés","VIRTUAL ","NACIONAL","2:00 - 3:00 p.m.","2019-04-02","LIBERTY MUTUAL",null,"ABRIL",null,null,null,null,2]
[null,"LIBERTY MUTUAL ","Silica: Competent Person and Control Plan Development","Requisito manejo del Inglés","VIRTUAL ","NACIONAL","2:00 - 3:00 p.m.","2019-03-21","LIBERTY MUTUAL",null,"MARZO",null,null,null,null,2]
[null,"LIBERTY MUTUAL ","Controlling Distracted Driving","Requisito manejo del Inglés","VIRTUAL ","NACIONAL","2:00 - 3:00 p.m.","2019-05-11","LIBERTY MUTUAL",null,"MAYO",null,null,null,null,2]
[null,"LIBERTY MUTUAL ","Prevention through Design","Requisito manejo del Inglés","VIRTUAL ","NACIONAL","2:00 - 3:00 p.m.","2019-05-08","LIBERTY MUTUAL",null,null,null,null,null,null,2]
[null,"LEGISLACIÓN SG SST","Actualización legal y normas en evolución  en el SGSST","Los participantes deben estar afiliados a la ARL LIBERTY  y  tener a cargo el Sistema de Gestión de Seguridad y Salud en el Trabajo o pertenecer al área de Recursos Humanos o al área jurídica","VIRTUAL ","NACIONAL","2:30 - 4:30 PM","2019-04-11","Liberty University","DIRECTOR JURIDICO - MAURICIO COLMENARES",{"$f":"UPPER(TEXT(H138,\"mmmm\"))","v":"ABRIL"},"Abierto",200,null,"2019-04-11",2]
[null,"LEGISLACIÓN SG SST","Actualización legal y normas en evolución  en el SGSST","Los participantes deben estar afiliados a la ARL LIBERTY  y  tener a cargo el Sistema de Gestión de Seguridad y Salud en el Trabajo o pertenecer al área de Recursos Humanos o al área jurídica","VIRTUAL ","NACIONAL","2:30 - 4:30 PM","2019-08-15","Liberty University","DIRECTOR JURIDICO - MAURICIO COLMENARES","AGOSTO","Abierto",200,null,"2019-08-15",2]
[null,"EXCEL EN SGSST","Herramientas de Excel para la formulación de bases de información del sistema de gestión ( validaciones y fórmulas) y tabla dinámica. ","Afiliados a ARL Liberty ","VIRTUAL ","NACIONAL","Abierto",{"$f":"+IF(O140>=TODAY(),O140,TODAY()+2)","v":"2019-10-31"},"Liberty University","PYP ","OCTUBRE","Abierto",200,null,"2019-03-04",8]
[null,"ESTILOS DE VIDA Y TRABAJO SALUDABLE","Importancia del programa de  estilos de vida y trabajo saludable y relación con los perfiles epidemiológicos.","Personal afiliado a Liberty Seguros. ","VIRTUAL ","NACIONAL","2:00 p.m. a 5:00 p.m.","2019-06-19","Liberty University","PYP ","JUNIO","Abierto",200,null,"2019-06-11",2]
[null,"ERGONOMIA","Curso Ergonomía","Personal con exposición a peligro biomecanico y responsable de SG - SST ","VIRTUAL ","NACIONAL","Abierto ",{"$f":"+IF(O142>=TODAY(),O142,TODAY()+2)","v":"2019-10-31"},"Liberty University","PYP ","OCTUBRE","Abierto",200,null,null,2]
[null,"ENTRENAMIENTOS PÁGINA WEB","Capacitación Web Masiva empresas activas","Empresas afiliadas a ARL Liberty  ","VIRTUAL ","NACIONAL","8:30 AM - 10:30A M","2019-02-14","Liberty University","ADMINISTRATIVA","FEBRERO","Abierto",200,null,null,2]
[null,"ENTRENAMIENTOS PÁGINA WEB","Capacitación Web Masiva empresas activas","Empresas afiliadas a ARL Liberty  ","VIRTUAL ","NACIONAL","8:30 AM - 10:30A M","2019-05-16","Liberty University","ADMINISTRATIVA","MAYO","Abierto",200,null,null,2]
[null,"ENTRENAMIENTOS PÁGINA WEB","Capacitación Web Masiva empresas activas","Empresas afiliadas a ARL Liberty  ","VIRTUAL ","NACIONAL","8:30 AM - 10:30A M","2019-08-15","Liberty University","ADMINISTRATIVA","AGOSTO","Abierto",200,null,null,2]
[null,"ENTRENAMIENTOS ADMINISTRATIVOS","Capacitación para independientes y afiliados sobre los deberes y derechos en el  SGRL y definiciones según normatividad","Empresas  e independientes voluntarios - mayor información en:\nAtención al cliente - tel. 3077050 ","PRESENCIAL ","BOGOTÁ","8:00 AM - 11:00A M","2019-01-23","Calle 72 N. 10 - 07 ","ADMINISTRATIVA","ENERO",25,2,null,null,3]
[null,"ENTRENAMIENTOS ADMINISTRATIVOS","Capacitación para independientes y afiliados sobre los deberes y derechos en el  SGRL y definiciones según normatividad","Empresas  e independientes voluntarios - mayor información en:\nAtención al cliente - tel. 3077050 ","PRESENCIAL ","BOGOTÁ","8:00 AM - 11:00A M","2019-02-13","Calle 73 N° 10 - 83 Torre C Oficina 302. Salón 302 Fucsia","ADMINISTRATIVA","FEBRERO",25,2,null,null,3]
[null,"ENTRENAMIENTOS ADMINISTRATIVOS","Capacitación para independientes y afiliados sobre los deberes y derechos en el  SGRL y definiciones según normatividad","Empresas  e independientes voluntarios - mayor información en:\nAtención al cliente - tel. 3077050 ","PRESENCIAL ","BOGOTÁ","8:00 AM - 11:00A M","2019-03-13","Calle 73 N° 10 - 83 Torre C Oficina 302. Salón 302 Fucsia","ADMINISTRATIVA","MARZO",25,2,null,null,3]
[null,"ENTRENAMIENTOS ADMINISTRATIVOS","Capacitación para independientes y afiliados sobre los deberes y derechos en el  SGRL y definiciones según normatividad","Empresas  e independientes voluntarios - mayor información en:\nAtención al cliente - tel. 3077050 ","PRESENCIAL ","BOGOTÁ","8:00 AM - 11:00A M","2019-04-10","Calle 73 N° 10 - 83 Torre C Oficina 302. Salón 302 Fucsia","ADMINISTRATIVA","ABRIL",25,2,null,null,3]
[null,"ENTRENAMIENTOS ADMINISTRATIVOS","Capacitación para independientes y afiliados sobre los deberes y derechos en el  SGRL y definiciones según normatividad","Empresas  e independientes voluntarios - mayor información en:\nAtención al cliente - tel. 3077050 ","PRESENCIAL ","BOGOTÁ","8:00 AM - 11:00A M","2019-05-15","Calle 73 N° 10 - 83 Torre C Oficina 302. Salón 302 Fucsia","ADMINISTRATIVA","MAYO",25,2,null,null,3]
[null,"ENTRENAMIENTOS ADMINISTRATIVOS","Capacitación para independientes y afiliados sobre los deberes y derechos en el  SGRL y definiciones según normatividad","Empresas  e independientes voluntarios - mayor información en:\nAtención al cliente - tel. 3077050 ","PRESENCIAL ","BOGOTÁ","8:00 AM - 11:00A M","2019-06-12","Calle 73 N° 10 - 83 Torre C Oficina 302. Salón 302 Fucsia","ADMINISTRATIVA","JUNIO",25,2,null,null,3]
[null,"ENTRENAMIENTOS ADMINISTRATIVOS","Capacitación para independientes y afiliados sobre los deberes y derechos en el  SGRL y definiciones según normatividad","Empresas  e independientes voluntarios - mayor información en:\nAtención al cliente - tel. 3077050 ","PRESENCIAL ","BOGOTÁ","8:00 AM - 11:00A M","2019-07-17","Calle 73 N° 10 - 83 Torre C Oficina 302. Salón 302 Fucsia","ADMINISTRATIVA","JULIO",25,2,null,null,3]
[null,"ENTRENAMIENTOS ADMINISTRATIVOS","Capacitación para independientes y afiliados sobre los deberes y derechos en el  SGRL y definiciones según normatividad","Empresas  e independientes voluntarios - mayor información en:\nAtención al cliente - tel. 3077050 ","PRESENCIAL ","BOGOTÁ","8:00 AM - 11:00A M","2019-08-14","Calle 73 N° 10 - 83 Torre C Oficina 302. Salón 302 Fucsia","ADMINISTRATIVA","AGOSTO",25,2,null,null,3]
[null,"ENTRENAMIENTOS ADMINISTRATIVOS","Capacitación para independientes y afiliados sobre los deberes y derechos en el  SGRL y definiciones según normatividad","Empresas  e independientes voluntarios - mayor información en:\nAtención al cliente - tel. 3077050 ","PRESENCIAL ","BOGOTÁ","8:00 AM - 11:00A M","2019-09-11","Calle 73 N° 10 - 83 Torre C Oficina 302. Salón 302 Fucsia","ADMINISTRATIVA","SEPTIEMBRE",25,2,null,null,3]
[null,"ENTRENAMIENTOS ADMINISTRATIVOS","Capacitación para independientes y afiliados sobre los deberes y derechos en el  SGRL y definiciones según normatividad","Empresas  e independientes voluntarios - mayor información en:\nAtención al cliente - tel. 3077050 ","PRESENCIAL ","BOGOTÁ","8:00 AM - 11:00A M","2019-10-09","Calle 73 N° 10 - 83 Torre C Oficina 302. Salón 302 Fucsia","ADMINISTRATIVA","OCTUBRE",25,2,null,null,3]
[null,"ENTRENAMIENTOS ADMINISTRATIVOS","Capacitación para independientes y afiliados sobre los deberes y derechos en el  SGRL y definiciones según normatividad","Empresas  e independientes voluntarios - mayor información en:\nAtención al cliente - tel. 3077050 ","PRESENCIAL ","BOGOTÁ","8:00 AM - 11:00A M","2019-12-11","Calle 73 N° 10 - 83 Torre C Oficina 302. Salón 302 Fucsia","ADMINISTRATIVA","DICIEMBRE",25,2,null,null,3]
[null,"ENTRENAMIENTOS ADMINISTRATIVOS","Capacitación para independientes y afiliados sobre los deberes y derechos en el  SGRL y definiciones según normatividad","Empresas  e independientes voluntarios - mayor información en:\nAtención al cliente - tel. 3077050 ","PRESENCIAL ","MEDELLÍN ","8:00 AM - 11:00A M","2019-01-23","Cra 43A No. 19-17, Piso 15","ADMINISTRATIVA","ENERO",25,2,null,null,3]
[null,"ENTRENAMIENTOS ADMINISTRATIVOS","Capacitación para independientes y afiliados sobre los deberes y derechos en el  SGRL y definiciones según normatividad","Empresas  e independientes voluntarios - mayor información en:\nAtención al cliente - tel. 3077050 ","PRESENCIAL ","MEDELLÍN ","8:00 AM - 11:00A M","2019-02-13","Cra 43A No. 19-17, Piso 15","ADMINISTRATIVA","FEBRERO",25,2,null,null,3]
[null,"ENTRENAMIENTOS ADMINISTRATIVOS","Capacitación para independientes y afiliados sobre los deberes y derechos en el  SGRL y definiciones según normatividad","Empresas  e independientes voluntarios - mayor información en:\nAtención al cliente - tel. 3077050 ","PRESENCIAL ","MEDELLÍN ","8:00 AM - 11:00A M","2019-03-13","Cra 43A No. 19-17, Piso 15","ADMINISTRATIVA","MARZO",25,2,null,null,3]
[null,"ENTRENAMIENTOS ADMINISTRATIVOS","Capacitación para independientes y afiliados sobre los deberes y derechos en el  SGRL y definiciones según normatividad","Empresas  e independientes voluntarios - mayor información en:\nAtención al cliente - tel. 3077050 ","PRESENCIAL ","MEDELLÍN ","8:00 AM - 11:00A M","2019-04-10","Cra 43A No. 19-17, Piso 15","ADMINISTRATIVA","ABRIL",25,2,null,null,3]
[null,"ENTRENAMIENTOS ADMINISTRATIVOS","Capacitación para independientes y afiliados sobre los deberes y derechos en el  SGRL y definiciones según normatividad","Empresas  e independientes voluntarios - mayor información en:\nAtención al cliente - tel. 3077050 ","PRESENCIAL ","MEDELLÍN ","8:00 AM - 11:00A M","2019-05-15","Cra 43A No. 19-17, Piso 15","ADMINISTRATIVA","MAYO",25,2,null,null,3]
[null,"ENTRENAMIENTOS ADMINISTRATIVOS","Capacitación para independientes y afiliados sobre los deberes y derechos en el  SGRL y definiciones según normatividad","Empresas  e independientes voluntarios - mayor información en:\nAtención al cliente - tel. 3077050 ","PRESENCIAL ","MEDELLÍN ","8:00 AM - 11:00A M","2019-06-12","Cra 43A No. 19-17, Piso 15","ADMINISTRATIVA","JUNIO",25,2,null,null,3]
[null,"ENTRENAMIENTOS ADMINISTRATIVOS","Capacitación para independientes y afiliados sobre los deberes y derechos en el  SGRL y definiciones según normatividad","Empresas  e independientes voluntarios - mayor información en:\nAtención al cliente - tel. 3077050 ","PRESENCIAL ","MEDELLÍN ","8:00 AM - 11:00A M","2019-07-17","Cra 43A No. 19-17, Piso 15","ADMINISTRATIVA","JULIO",25,2,null,null,3]
[null,"ENTRENAMIENTOS ADMINISTRATIVOS","Capacitación para independientes y afiliados sobre los deberes y derechos en el  SGRL y definiciones según normatividad","Empresas  e independientes voluntarios - mayor información en:\nAtención al cliente - tel. 3077050 ","PRESENCIAL ","MEDELLÍN ","8:00 AM - 11:00A M","2019-08-14","Cra 43A No. 19-17, Piso 15","ADMINISTRATIVA","AGOSTO",25,2,null,null,3]
[null,"ENTRENAMIENTOS ADMINISTRATIVOS","Capacitación para independientes y afiliados sobre los deberes y derechos en el  SGRL y definiciones según normatividad","Empresas  e independientes voluntarios - mayor información en:\nAtención al cliente - tel. 3077050 ","PRESENCIAL ","MEDELLÍN ","8:00 AM - 11:00A M","2019-09-11","Cra 43A No. 19-17, Piso 15","ADMINISTRATIVA","SEPTIEMBRE",25,2,null,null,3]
[null,"ENTRENAMIENTOS ADMINISTRATIVOS","Capacitación para independientes y afiliados sobre los deberes y derechos en el  SGRL y definiciones según normatividad","Empresas  e independientes voluntarios - mayor información en:\nAtención al cliente - tel. 3077050 ","PRESENCIAL ","MEDELLÍN ","8:00 AM - 11:00A M","2019-10-09","Cra 43A No. 19-17, Piso 15","ADMINISTRATIVA","OCTUBRE",25,2,null,null,3]
[null,"ENTRENAMIENTOS ADMINISTRATIVOS","Capacitación para independientes y afiliados sobre los deberes y derechos en el  SGRL y definiciones según normatividad","Empresas  e independientes voluntarios - mayor información en:\nAtención al cliente - tel. 3077050 ","PRESENCIAL ","MEDELLÍN ","8:00 AM - 11:00A M","2019-12-11","Cra 43A No. 19-17, Piso 15","ADMINISTRATIVA",{"$f":"UPPER(TEXT(H167,\"mmmm\"))","v":"DICIEMBRE"},25,2,null,null,3]
[null,"ENTRENAMIENTOS ADMINISTRATIVOS","Capacitación para independientes y afiliados sobre los deberes y derechos en el  SGRL y definiciones según normatividad","Empresas  e independientes voluntarios - mayor información en:\nAtención al cliente - tel. 3077050 ","PRESENCIAL ","BARRANQUILLA","8:00 AM - 11:00A M","2019-01-23","Calle 77 No. 59 - 35 OFC 1403 CENTRO EMPRESARIAL AMERICAS 3","ADMINISTRATIVA","ENERO",25,3,null,null,3]
[null,"ENTRENAMIENTOS ADMINISTRATIVOS","Capacitación para independientes y afiliados sobre los deberes y derechos en el  SGRL y definiciones según normatividad","Empresas  e independientes voluntarios - mayor información en:\nAtención al cliente - tel. 3077050 ","PRESENCIAL ","BARRANQUILLA","8:00 AM - 11:00A M","2019-02-13","Calle 77 No. 59 - 35 OFC 1403 CENTRO EMPRESARIAL AMERICAS 3","ADMINISTRATIVA","FEBRERO",25,3,null,null,3]
[null,"ENTRENAMIENTOS ADMINISTRATIVOS","Capacitación para independientes y afiliados sobre los deberes y derechos en el  SGRL y definiciones según normatividad","Empresas  e independientes voluntarios - mayor información en:\nAtención al cliente - tel. 3077050 ","PRESENCIAL ","BARRANQUILLA","8:00 AM - 11:00A M","2019-03-13","Calle 77 No. 59 - 35 OFC 1403 CENTRO EMPRESARIAL AMERICAS 3","ADMINISTRATIVA","MARZO",25,3,null,null,3]
[null,"ENTRENAMIENTOS ADMINISTRATIVOS","Capacitación para independientes y afiliados sobre los deberes y derechos en el  SGRL y definiciones según normatividad","Empresas  e independientes voluntarios - mayor información en:\nAtención al cliente - tel. 3077050 ","PRESENCIAL ","BARRANQUILLA","8:00 AM - 11:00A M","2019-04-10","Calle 77 No. 59 - 35 OFC 1403 CENTRO EMPRESARIAL AMERICAS 3","ADMINISTRATIVA","ABRIL",25,3,null,null,3]
[null,"ENTRENAMIENTOS ADMINISTRATIVOS","Capacitación para independientes y afiliados sobre los deberes y derechos en el  SGRL y definiciones según normatividad","Empresas  e independientes voluntarios - mayor información en:\nAtención al cliente - tel. 3077050 ","PRESENCIAL ","BARRANQUILLA","8:00 AM - 11:00A M","2019-05-15","Calle 77 No. 59 - 35 OFC 1403 CENTRO EMPRESARIAL AMERICAS 3","ADMINISTRATIVA","MAYO",25,3,null,null,3]
[null,"ENTRENAMIENTOS ADMINISTRATIVOS","Capacitación para independientes y afiliados sobre los deberes y derechos en el  SGRL y definiciones según normatividad","Empresas  e independientes voluntarios - mayor información en:\nAtención al cliente - tel. 3077050 ","PRESENCIAL ","BARRANQUILLA","8:00 AM - 11:00A M","2019-06-12","Calle 77 No. 59 - 35 OFC 1403 CENTRO EMPRESARIAL AMERICAS 3","ADMINISTRATIVA","JUNIO",25,3,null,null,3]
[null,"ENTRENAMIENTOS ADMINISTRATIVOS","Capacitación para independientes y afiliados sobre los deberes y derechos en el  SGRL y definiciones según normatividad","Empresas  e independientes voluntarios - mayor información en:\nAtención al cliente - tel. 3077050 ","PRESENCIAL ","BARRANQUILLA","8:00 AM - 11:00A M","2019-07-17","Calle 77 No. 59 - 35 OFC 1403 CENTRO EMPRESARIAL AMERICAS 3","ADMINISTRATIVA","JULIO",25,3,null,null,3]
[null,"ENTRENAMIENTOS ADMINISTRATIVOS","Capacitación para independientes y afiliados sobre los deberes y derechos en el  SGRL y definiciones según normatividad","Empresas  e independientes voluntarios - mayor información en:\nAtención al cliente - tel. 3077050 ","PRESENCIAL ","BARRANQUILLA","8:00 AM - 11:00A M","2019-08-14","Calle 77 No. 59 - 35 OFC 1403 CENTRO EMPRESARIAL AMERICAS 3","ADMINISTRATIVA","AGOSTO",25,3,null,null,3]
[null,"ENTRENAMIENTOS ADMINISTRATIVOS","Capacitación para independientes y afiliados sobre los deberes y derechos en el  SGRL y definiciones según normatividad","Empresas  e independientes voluntarios - mayor información en:\nAtención al cliente - tel. 3077050 ","PRESENCIAL ","BARRANQUILLA","8:00 AM - 11:00A M","2019-09-11","Calle 77 No. 59 - 35 OFC 1403 CENTRO EMPRESARIAL AMERICAS 3","ADMINISTRATIVA","SEPTIEMBRE",25,3,null,null,3]
[null,"ENTRENAMIENTOS ADMINISTRATIVOS","Capacitación para independientes y afiliados sobre los deberes y derechos en el  SGRL y definiciones según normatividad","Empresas  e independientes voluntarios - mayor información en:\nAtención al cliente - tel. 3077050 ","PRESENCIAL ","BARRANQUILLA","8:00 AM - 11:00A M","2019-10-09","Calle 77 No. 59 - 35 OFC 1403 CENTRO EMPRESARIAL AMERICAS 3","ADMINISTRATIVA","OCTUBRE",25,3,null,null,3]
[null,"ENTRENAMIENTOS ADMINISTRATIVOS","Capacitación para independientes y afiliados sobre los deberes y derechos en el  SGRL y definiciones según normatividad","Empresas  e independientes voluntarios - mayor información en:\nAtención al cliente - tel. 3077050 ","PRESENCIAL ","BARRANQUILLA","8:00 AM - 11:00A M","2019-12-11","Calle 77 No. 59 - 35 OFC 1403 CENTRO EMPRESARIAL AMERICAS 3","ADMINISTRATIVA","DICIEMBRE",25,3,null,null,3]
[null,"ENTRENAMIENTOS ADMINISTRATIVOS","Capacitación para independientes y afiliados sobre los deberes y derechos en el  SGRL y definiciones según normatividad","Empresas  e independientes voluntarios - mayor información en:\nAtención al cliente - tel. 3077050 ","PRESENCIAL ","CARTAGENA","8:00 AM - 11:00A M","2019-01-23","Liberty Seguros, Calle del Arsenal No 8B-195 piso 1","ADMINISTRATIVA","ENERO",25,2,"AIS Ltda",null,3]
[null,"ENTRENAMIENTOS ADMINISTRATIVOS","Capacitación para independientes y afiliados sobre los deberes y derechos en el  SGRL y definiciones según normatividad","Empresas  e independientes voluntarios - mayor información en:\nAtención al cliente - tel. 3077050 ","PRESENCIAL ","CARTAGENA","8:00 AM - 11:00A M","2019-02-13","Liberty Seguros, Calle del Arsenal No 8B-195 piso 1","ADMINISTRATIVA","FEBRERO",25,2,"AIS Ltda",null,3]
[null,"ENTRENAMIENTOS ADMINISTRATIVOS","Capacitación para independientes y afiliados sobre los deberes y derechos en el  SGRL y definiciones según normatividad","Empresas  e independientes voluntarios - mayor información en:\nAtención al cliente - tel. 3077050 ","PRESENCIAL ","CARTAGENA","8:00 AM - 11:00A M","2019-03-13","Liberty Seguros, Calle del Arsenal No 8B-195 piso 1","ADMINISTRATIVA","MARZO",25,2,"AIS Ltda",null,3]
[null,"ENTRENAMIENTOS ADMINISTRATIVOS","Capacitación para independientes y afiliados sobre los deberes y derechos en el  SGRL y definiciones según normatividad","Empresas  e independientes voluntarios - mayor información en:\nAtención al cliente - tel. 3077050 ","PRESENCIAL ","CARTAGENA","8:00 AM - 11:00A M","2019-04-10","Liberty Seguros, Calle del Arsenal No 8B-195 piso 1","ADMINISTRATIVA","ABRIL",25,2,"AIS Ltda",null,3]
[null,"ENTRENAMIENTOS ADMINISTRATIVOS","Capacitación para independientes y afiliados sobre los deberes y derechos en el  SGRL y definiciones según normatividad","Empresas  e independientes voluntarios - mayor información en:\nAtención al cliente - tel. 3077050 ","PRESENCIAL ","CARTAGENA","8:00 AM - 11:00A M","2019-05-15","Liberty Seguros, Calle del Arsenal No 8B-195 piso 1","ADMINISTRATIVA","MAYO",25,2,"AIS Ltda",null,3]
[null,"ENTRENAMIENTOS ADMINISTRATIVOS","Capacitación para independientes y afiliados sobre los deberes y derechos en el  SGRL y definiciones según normatividad","Empresas  e independientes voluntarios - mayor información en:\nAtención al cliente - tel. 3077050 ","PRESENCIAL ","CARTAGENA","8:00 AM - 11:00A M","2019-06-12","Liberty Seguros, Calle del Arsenal No 8B-195 piso 1","ADMINISTRATIVA","JUNIO",25,2,"AIS Ltda",null,3]
[null,"ENTRENAMIENTOS ADMINISTRATIVOS","Capacitación para independientes y afiliados sobre los deberes y derechos en el  SGRL y definiciones según normatividad","Empresas  e independientes voluntarios - mayor información en:\nAtención al cliente - tel. 3077050 ","PRESENCIAL ","CARTAGENA","8:00 AM - 11:00A M","2019-07-17","Liberty Seguros, Calle del Arsenal No 8B-195 piso 1","ADMINISTRATIVA","JULIO",25,2,"AIS Ltda",null,3]
[null,"ENTRENAMIENTOS ADMINISTRATIVOS","Capacitación para independientes y afiliados sobre los deberes y derechos en el  SGRL y definiciones según normatividad","Empresas  e independientes voluntarios - mayor información en:\nAtención al cliente - tel. 3077050 ","PRESENCIAL ","CARTAGENA","8:00 AM - 11:00A M","2019-08-14","Liberty Seguros, Calle del Arsenal No 8B-195 piso 1","ADMINISTRATIVA","AGOSTO",25,2,"AIS Ltda",null,3]
[null,"ENTRENAMIENTOS ADMINISTRATIVOS","Capacitación para independientes y afiliados sobre los deberes y derechos en el  SGRL y definiciones según normatividad","Empresas  e independientes voluntarios - mayor información en:\nAtención al cliente - tel. 3077050 ","PRESENCIAL ","CARTAGENA","8:00 AM - 11:00A M","2019-09-11","Liberty Seguros, Calle del Arsenal No 8B-195 piso 1","ADMINISTRATIVA","SEPTIEMBRE",25,2,"AIS Ltda",null,3]
[null,"ENTRENAMIENTOS ADMINISTRATIVOS","Capacitación para independientes y afiliados sobre los deberes y derechos en el  SGRL y definiciones según normatividad","Empresas  e independientes voluntarios - mayor información en:\nAtención al cliente - tel. 3077050 ","PRESENCIAL ","CARTAGENA","8:00 AM - 11:00A M","2019-10-09","Liberty Seguros, Calle del Arsenal No 8B-195 piso 1","ADMINISTRATIVA","OCTUBRE",25,2,"AIS Ltda",null,3]
[null,"ENTRENAMIENTOS ADMINISTRATIVOS","Capacitación para independientes y afiliados sobre los deberes y derechos en el  SGRL y definiciones según normatividad","Empresas  e independientes voluntarios - mayor información en:\nAtención al cliente - tel. 3077050 ","PRESENCIAL ","CARTAGENA","8:00 AM - 11:00A M","2019-12-11","Liberty Seguros, Calle del Arsenal No 8B-195 piso 1","ADMINISTRATIVA","DICIEMBRE",25,2,"AIS Ltda",null,3]
[null,"ENTRENAMIENTOS ADMINISTRATIVOS","Capacitación para independientes y afiliados sobre los deberes y derechos en el  SGRL y definiciones según normatividad","Empresas  e independientes voluntarios - mayor información en:\nAtención al cliente - tel. 3077050 ","PRESENCIAL ","CALI","8:00 AM - 11:00A M","2019-01-23","Cr 36 Norte No. 6A - 65 Piso 23, Oficina 2301","ADMINISTRATIVA","ENERO",25,2,"GIPSO",null,3]
[null,"ENTRENAMIENTOS ADMINISTRATIVOS","Capacitación para independientes y afiliados sobre los deberes y derechos en el  SGRL y definiciones según normatividad","Empresas  e independientes voluntarios - mayor información en:\nAtención al cliente - tel. 3077050 ","PRESENCIAL ","CALI","8:00 AM - 11:00A M","2019-02-13","Cr 36 Norte No. 6A - 65 Piso 23, Oficina 2301","ADMINISTRATIVA","FEBRERO",25,2,"GIPSO",null,3]
[null,"ENTRENAMIENTOS ADMINISTRATIVOS","Capacitación para independientes y afiliados sobre los deberes y derechos en el  SGRL y definiciones según normatividad","Empresas  e independientes voluntarios - mayor información en:\nAtención al cliente - tel. 3077050 ","PRESENCIAL ","CALI","8:00 AM - 11:00A M","2019-03-13","Cr 36 Norte No. 6A - 65 Piso 23, Oficina 2301","ADMINISTRATIVA","MARZO",25,2,"GIPSO",null,3]
[null,"ENTRENAMIENTOS ADMINISTRATIVOS","Capacitación para independientes y afiliados sobre los deberes y derechos en el  SGRL y definiciones según normatividad","Empresas  e independientes voluntarios - mayor información en:\nAtención al cliente - tel. 3077050 ","PRESENCIAL ","CALI","8:00 AM - 11:00A M","2019-04-10","Cr 36 Norte No. 6A - 65 Piso 23, Oficina 2301","ADMINISTRATIVA","ABRIL",25,2,"GIPSO",null,3]
[null,"ENTRENAMIENTOS ADMINISTRATIVOS","Capacitación para independientes y afiliados sobre los deberes y derechos en el  SGRL y definiciones según normatividad","Empresas  e independientes voluntarios - mayor información en:\nAtención al cliente - tel. 3077050 ","PRESENCIAL ","CALI","8:00 AM - 11:00A M","2019-05-15","Cr 36 Norte No. 6A - 65 Piso 23, Oficina 2301","ADMINISTRATIVA","MAYO",25,2,"GIPSO",null,3]
[null,"ENTRENAMIENTOS ADMINISTRATIVOS","Capacitación para independientes y afiliados sobre los deberes y derechos en el  SGRL y definiciones según normatividad","Empresas  e independientes voluntarios - mayor información en:\nAtención al cliente - tel. 3077050 ","PRESENCIAL ","CALI","8:00 AM - 11:00A M","2019-06-12","Cr 36 Norte No. 6A - 65 Piso 23, Oficina 2301","ADMINISTRATIVA","JUNIO",25,2,"GIPSO",null,3]
[null,"ENTRENAMIENTOS ADMINISTRATIVOS","Capacitación para independientes y afiliados sobre los deberes y derechos en el  SGRL y definiciones según normatividad","Empresas  e independientes voluntarios - mayor información en:\nAtención al cliente - tel. 3077050 ","PRESENCIAL ","CALI","8:00 AM - 11:00A M","2019-07-17","Cr 36 Norte No. 6A - 65 Piso 23, Oficina 2301","ADMINISTRATIVA","JULIO",25,2,"GIPSO",null,3]
[null,"ENTRENAMIENTOS ADMINISTRATIVOS","Capacitación para independientes y afiliados sobre los deberes y derechos en el  SGRL y definiciones según normatividad","Empresas  e independientes voluntarios - mayor información en:\nAtención al cliente - tel. 3077050 ","PRESENCIAL ","CALI","8:00 AM - 11:00A M","2019-08-14","Cr 36 Norte No. 6A - 65 Piso 23, Oficina 2301","ADMINISTRATIVA",{"$f":"UPPER(TEXT(H197,\"mmmm\"))","v":"AGOSTO"},25,2,"GIPSO",null,3]
[null,"ENTRENAMIENTOS ADMINISTRATIVOS","Capacitación para independientes y afiliados sobre los deberes y derechos en el  SGRL y definiciones según normatividad","Empresas  e independientes voluntarios - mayor información en:\nAtención al cliente - tel. 3077050 ","PRESENCIAL ","CALI","8:00 AM - 11:00A M","2019-09-11","Cr 36 Norte No. 6A - 65 Piso 23, Oficina 2301","ADMINISTRATIVA","SEPTIEMBRE",25,2,"GIPSO",null,3]
[null,"ENTRENAMIENTOS ADMINISTRATIVOS","Capacitación para independientes y afiliados sobre los deberes y derechos en el  SGRL y definiciones según normatividad","Empresas  e independientes voluntarios - mayor información en:\nAtención al cliente - tel. 3077050 ","PRESENCIAL ","CALI","8:00 AM - 11:00A M","2019-10-09","Cr 36 Norte No. 6A - 65 Piso 23, Oficina 2301","ADMINISTRATIVA","OCTUBRE",25,2,"GIPSO",null,3]
[null,"ENTRENAMIENTOS ADMINISTRATIVOS","Capacitación para independientes y afiliados sobre los deberes y derechos en el  SGRL y definiciones según normatividad","Empresas  e independientes voluntarios - mayor información en:\nAtención al cliente - tel. 3077050 ","PRESENCIAL ","CALI","8:00 AM - 11:00A M","2019-12-11","Cr 36 Norte No. 6A - 65 Piso 23, Oficina 2301","ADMINISTRATIVA","DICIEMBRE",25,2,"GIPSO",null,3]
[null,"ENTRENAMIENTOS ADMINISTRATIVOS","Capacitación para independientes y afiliados sobre los deberes y derechos en el  SGRL y definiciones según normatividad","Empresas  e independientes voluntarios - mayor información en:\nAtención al cliente - tel. 3077050 ","PRESENCIAL ","BUCARAMANGA","8:00 AM - 11:00A M","2019-01-23","Transv. Oriental No 90-102 Torre Empresarial Cacique Oficinas  703 – 704","ADMINISTRATIVA","ENERO",25,2,"Estrategias y soluciones en gestión del riesgo",null,3]
[null,"ENTRENAMIENTOS ADMINISTRATIVOS","Capacitación para independientes y afiliados sobre los deberes y derechos en el  SGRL y definiciones según normatividad","Empresas  e independientes voluntarios - mayor información en:\nAtención al cliente - tel. 3077050 ","PRESENCIAL ","BUCARAMANGA","8:00 AM - 11:00A M","2019-02-13","Transv. Oriental No 90-102 Torre Empresarial Cacique Oficinas  703 – 704","ADMINISTRATIVA","FEBRERO",25,2,"Estrategias y soluciones en gestión del riesgo",null,3]
[null,"ENTRENAMIENTOS ADMINISTRATIVOS","Capacitación para independientes y afiliados sobre los deberes y derechos en el  SGRL y definiciones según normatividad","Empresas  e independientes voluntarios - mayor información en:\nAtención al cliente - tel. 3077050 ","PRESENCIAL ","BUCARAMANGA","8:00 AM - 11:00A M","2019-03-13","Transv. Oriental No 90-102 Torre Empresarial Cacique Oficinas  703 – 704","ADMINISTRATIVA","MARZO",25,2,"Gestión Interriesgos",null,3]
[null,"ENTRENAMIENTOS ADMINISTRATIVOS","Capacitación para independientes y afiliados sobre los deberes y derechos en el  SGRL y definiciones según normatividad","Empresas  e independientes voluntarios - mayor información en:\nAtención al cliente - tel. 3077050 ","PRESENCIAL ","BUCARAMANGA","8:00 AM - 11:00A M","2019-04-10","Transv. Oriental No 90-102 Torre Empresarial Cacique Oficinas  703 – 704","ADMINISTRATIVA","ABRIL",25,2,"Gestión Interriesgos",null,3]
[null,"ENTRENAMIENTOS ADMINISTRATIVOS","Capacitación para independientes y afiliados sobre los deberes y derechos en el  SGRL y definiciones según normatividad","Empresas  e independientes voluntarios - mayor información en:\nAtención al cliente - tel. 3077050 ","PRESENCIAL ","BUCARAMANGA","8:00 AM - 11:00A M","2019-05-15","Transv. Oriental No 90-102 Torre Empresarial Cacique Oficinas  703 – 704","ADMINISTRATIVA","MAYO",25,2,null,null,3]
[null,"ENTRENAMIENTOS ADMINISTRATIVOS","Capacitación para independientes y afiliados sobre los deberes y derechos en el  SGRL y definiciones según normatividad","Empresas  e independientes voluntarios - mayor información en:\nAtención al cliente - tel. 3077050 ","PRESENCIAL ","BUCARAMANGA","8:00 AM - 11:00A M","2019-06-12","Transv. Oriental No 90-102 Torre Empresarial Cacique Oficinas  703 – 704","ADMINISTRATIVA","JUNIO",25,2,null,null,3]
[null,"ENTRENAMIENTOS ADMINISTRATIVOS","Capacitación para independientes y afiliados sobre los deberes y derechos en el  SGRL y definiciones según normatividad","Empresas  e independientes voluntarios - mayor información en:\nAtención al cliente - tel. 3077050 ","PRESENCIAL ","BUCARAMANGA","8:00 AM - 11:00A M","2019-07-17","Transv. Oriental No 90-102 Torre Empresarial Cacique Oficinas  703 – 704","ADMINISTRATIVA","JULIO",25,2,null,null,3]
[null,"ENTRENAMIENTOS ADMINISTRATIVOS","Capacitación para independientes y afiliados sobre los deberes y derechos en el  SGRL y definiciones según normatividad","Empresas  e independientes voluntarios - mayor información en:\nAtención al cliente - tel. 3077050 ","PRESENCIAL ","BUCARAMANGA","8:00 AM - 11:00A M","2019-08-14","Transv. Oriental No 90-102 Torre Empresarial Cacique Oficinas  703 – 704","ADMINISTRATIVA","AGOSTO",25,2,null,null,3]
[null,"ENTRENAMIENTOS ADMINISTRATIVOS","Capacitación para independientes y afiliados sobre los deberes y derechos en el  SGRL y definiciones según normatividad","Empresas  e independientes voluntarios - mayor información en:\nAtención al cliente - tel. 3077050 ","PRESENCIAL ","BUCARAMANGA","8:00 AM - 11:00A M","2019-09-11","Transv. Oriental No 90-102 Torre Empresarial Cacique Oficinas  703 – 704","ADMINISTRATIVA","SEPTIEMBRE",25,2,null,null,3]
[null,"ENTRENAMIENTOS ADMINISTRATIVOS","Capacitación para independientes y afiliados sobre los deberes y derechos en el  SGRL y definiciones según normatividad","Empresas  e independientes voluntarios - mayor información en:\nAtención al cliente - tel. 3077050 ","PRESENCIAL ","BUCARAMANGA","8:00 AM - 11:00A M","2019-10-09","Transv. Oriental No 90-102 Torre Empresarial Cacique Oficinas  703 – 704","ADMINISTRATIVA","OCTUBRE",25,2,null,null,3]
[null,"ENTRENAMIENTOS ADMINISTRATIVOS","Capacitación para independientes y afiliados sobre los deberes y derechos en el  SGRL y definiciones según normatividad","Empresas  e independientes voluntarios - mayor información en:\nAtención al cliente - tel. 3077050 ","PRESENCIAL ","BUCARAMANGA","8:00 AM - 11:00A M","2019-12-11","Transv. Oriental No 90-102 Torre Empresarial Cacique Oficinas  703 – 704","ADMINISTRATIVA","DICIEMBRE",25,2,null,null,3]
[null,"ENTRENAMIENTO GERENCIAL ","Estabilidad laboral reforzada un reto organizacional","Gerentes de empresas afiliadas","PRESENCIAL ","BARRANCABERMEJA","8:00 am - 10:00 a.m.","2019-03-14","Hotel San Silvestre Cra 19 # 58a–13","GPS CIUDAD","MARZO",25,2,null,null,2]
[null,"ENTRENAMIENTO GERENCIAL ","Estabilidad laboral reforzada un reto organizacional","Gerentes de empresas afiliadas","PRESENCIAL ","BARRANQUILLA","8:00 am - 10:00 a.m.","2019-03-19","ICONTEC Cra 57 No. 70-89 Barranquilla","GPS CIUDAD","MARZO",25,3,null,null,2]
[null,"ENTRENAMIENTO GERENCIAL ","Estabilidad laboral reforzada un reto organizacional","Gerentes empresas afiliadas ARL Liberty ","PRESENCIAL ","BOGOTÁ","8:00 am - 10:00 a.m.","2019-03-07","Calle 72 # 10 -07   AUDITORIO Piso 6","PYP","MARZO",35,2,null,null,2]
[null,"ENTRENAMIENTO GERENCIAL ","Rentabilidad en seguridad y salud en el trabajo. ","Gerentes de empresas afiliadas","PRESENCIAL ","BOGOTÁ","8:00 am - 10:00 a.m.","2019-06-20","Calle 72 # 10 -07   AUDITORIO Piso 6","PYP","JUNIO",35,2,null,null,2]
[null,"ENTRENAMIENTO GERENCIAL ","Estabilidad laboral reforzada un reto organizacional","Gerentes de empresas afiliadas","PRESENCIAL ","BOGOTÁ","8:00 am - 10:00 a.m.","2019-08-28","Calle 73 N° 10 - 83 Torre C Oficina 302. Salón 302 Fucsia","PYP","AGOSTO",35,2,"Montajes y procesos mgonzalez@montajesyprocesos.com",null,2]
[null,"ENTRENAMIENTO GERENCIAL ","Sostenibilidad: Una fuerza transformadora de la seguridad y salud en el trabajo.","Gerentes de empresas afiliadas","PRESENCIAL ","BOGOTÁ","8:00 am - 10:00 a.m.","2019-11-28","Calle 73 N° 10 - 83 Torre C Oficina 302. Salón 302 Fucsia","PYP","NOVIEMBRE",35,2,"Montajes y procesos mgonzalez@montajesyprocesos.com",null,2]
[null,"ENTRENAMIENTO GERENCIAL ","Estabilidad laboral reforzada un reto organizacional","Gerentes de empresas afiliadas","PRESENCIAL ","BUCARAMANGA","8:00 am - 10:00 a.m.","2019-03-07","Hotel La Triada Cra. 20 #34--22","GPS CIUDAD","MARZO",25,2,null,null,2]
[null,"ENTRENAMIENTO GERENCIAL ","Tendencias globales en Seguridad y salud en el trabajo ","Gerentes de empresas afiliadas","PRESENCIAL ","BUCARAMANGA","8:00 am - 10:00 a.m.","2019-08-22","Hotel La Triada Cra. 20 #34--22","GPS CIUDAD","AGOSTO",25,2,null,null,2]
[null,"ENTRENAMIENTO GERENCIAL ","Estabilidad laboral reforzada un reto organizacional","Gerentes de empresas afiliadas","PRESENCIAL ","CALI","8:00 am - 10:00 a.m.","2019-03-14","Club de Ejecutivos Av. 4N # 23DN - 65 Piso 9","GPS CIUDAD","MARZO",30,2,"SAFE SAS",null,2]
[null,"ENTRENAMIENTO GERENCIAL ","Tendencias globales en Seguridad y salud en el trabajo ","Gerentes de empresas afiliadas","PRESENCIAL ","CALI","8:00 am - 10:00 a.m.","2019-08-22","Club de Ejecutivos Av. 4N # 23DN - 65 Piso 9\n","GPS CIUDAD","AGOSTO",30,2,"SAFE SAS",null,2]
[null,"ENTRENAMIENTO GERENCIAL ","Estabilidad laboral reforzada un reto organizacional","Gerentes de empresas afiliadas","PRESENCIAL ","CARTAGENA","8:00 am - 10:00 a.m.","2019-03-07","Liberty Seguros, Calle del Arsenal No 8B-195 piso 1","GPS CIUDAD","MARZO",25,2,"Por definir",null,2]
[null,"ENTRENAMIENTO GERENCIAL ","continuidad y sostenibilidad del negocio desde SST","Gerentes de empresas afiliadas","PRESENCIAL ","MEDELLÍN ","8:00 am - 10:00 a.m.","2019-05-16","Previo a la actividad se estará confirmando lugar del evento ","GPS CIUDAD","MAYO",40,2,null,null,2]
[null,"ENTRENAMIENTO GERENCIAL ","Tendencias globales en Seguridad y salud en el trabajo ","Gerentes de empresas afiliadas","PRESENCIAL ","MEDELLÍN ","8:00 am - 10:00 a.m.","2019-09-19","Previo a la actividad se estará confirmando lugar del evento ","GPS CIUDAD","SEPTIEMBRE",40,2,null,null,2]
[null,"EMERGENCIAS","BRIGADAS DE EMERGENCIAS (Primeros Auxilios, Control de incendios y Evacuación)","Brigadistas","VIRTUAL ","NACIONAL","Abierto ","2019-03-11","curso virtual cruz roja colombiana ","PYP ","MARZO",200,2,"Cruz",null,40]
[null,"EMERGENCIAS","BRIGADAS DE EMERGENCIAS (Primeros Auxilios, Control de incendios y Evacuación)","Brigadistas","VIRTUAL ","NACIONAL","Abierto a partir de agosto","2019-08-05","curso virtual cruz roja colombiana ","PYP ","AGOSTO",200,2,"Cruz",null,40]
[null,"EMERGENCIAS","Curso de emergencias.  Módulo 1. Primeros auxilios ","Brigadistas","PRESENCIAL ","BOGOTÁ","8:00 a.m. - 12:00 m","2019-04-11","Calle 73 N° 10 - 83 Torre C Oficina 302. Salón 302 Fucsia","PYP ",{"$f":"UPPER(TEXT(H227,\"mmmm\"))","v":"ABRIL"},40,2,null,null,4]
[null,"EMERGENCIAS","Curso de emergencias.  Módulo 2. Evacuación y plan de emergencia.","Brigadistas","PRESENCIAL ","BOGOTÁ","8:00 a.m. - 12:00 m","2019-05-16","Calle 73 N° 10 - 83 Torre C Oficina 302. Salón 302 Fucsia","PYP ","MAYO",40,2,null,null,4]
[null,"EMERGENCIAS","Curso de emergencias.  Módulo 3. Contraincendio y recursos para emergencias.  ","Brigadistas","PRESENCIAL ","BOGOTÁ","8:00 a.m. - 12:00 m","2019-06-13","Calle 73 N° 10 - 83 Torre C Oficina 302. Salón 302 Fucsia","PYP ","JUNIO",40,2,null,null,4]
[null,"EMERGENCIAS","Curso de emergencias.  Módulo 1. Primeros auxilios ","Brigadistas","PRESENCIAL ","BARRANCABERMEJA","8:00 a.m. - 12:00 m","2019-04-11","Hotel San Silvestre Cra 19 # 58a–13","GPS CIUDAD","ABRIL",25,2,null,null,4]
[null,"EMERGENCIAS","Curso de emergencias.  Módulo 2. Evacuación y plan de emergencia.","Brigadistas","PRESENCIAL ","BARRANCABERMEJA","8:00 a.m. - 12:00 m","2019-05-16","Hotel San Silvestre Cra 19 # 58a–13","GPS CIUDAD","MAYO",25,2,null,null,4]
[null,"EMERGENCIAS","Curso de emergencias.  Módulo 3. Contraincendio y recursos para emergencias.  ","Brigadistas","PRESENCIAL ","BARRANCABERMEJA","8:00 a.m. - 12:00 m","2019-06-13","Hotel San Silvestre Cra 19 # 58a–13","GPS CIUDAD","JUNIO",25,2,null,null,4]
[null,"EMERGENCIAS","Curso de emergencias.  Módulo 1. Primeros auxilios ","Brigadistas","PRESENCIAL ","BUCARAMANGA","8:00 a.m. - 12:00 m","2019-04-11","CAJASAN Campo Alegre Vía Bucaramanga - Piedecuesta","GPS CIUDAD","ABRIL",25,2,null,null,4]
[null,"EMERGENCIAS","Curso de emergencias.  Módulo 2. Evacuación y plan de emergencia.","Brigadistas","PRESENCIAL ","BUCARAMANGA","8:00 a.m. - 12:00 m","2019-05-16","CAJASAN Campo Alegre Vía Bucaramanga - Piedecuesta","GPS CIUDAD","MAYO",25,2,null,null,4]
[null,"EMERGENCIAS","Curso de emergencias.  Módulo 3. Contraincendio y recursos para emergencias.  ","Brigadistas","PRESENCIAL ","BUCARAMANGA","8:00 a.m. - 12:00 m","2019-06-13","CAJASAN Campo Alegre Vía Bucaramanga - Piedecuesta","GPS CIUDAD","JUNIO",25,2,null,null,4]
[null,"EMERGENCIAS","Curso de emergencias.  Módulo 1. Primeros auxilios ","Brigadistas","PRESENCIAL ","CALI","8:00 a.m. - 12:00 m","2019-04-12","Av. 5 Norte # 38N-81","GPS CIUDAD","ABRIL",30,2,"SAFE SAS",null,4]
[null,"EMERGENCIAS","Curso de emergencias.  Módulo 2. Evacuación y plan de emergencia.","Brigadistas","PRESENCIAL ","CALI","8:00 a.m. - 12:00 m","2019-05-17","Av. 5 Norte # 38N-81","GPS CIUDAD","MAYO",30,2,"SAFE SAS",null,4]
[null,"EMERGENCIAS","Curso de emergencias.  Módulo 3. Contraincendio y recursos para emergencias.  ","Brigadistas","PRESENCIAL ","CALI","8:00 a.m. - 12:00 m","2019-06-14","Av. 5 Norte # 38N-81","GPS CIUDAD","JUNIO",30,2,"SAFE SAS",null,4]
[null,"EMERGENCIAS","Curso de emergencias.  Módulo 1. Primeros auxilios ","Brigadistas","PRESENCIAL ","CARTAGENA","8:00 a.m. - 12:00 m","2019-04-11","Liberty Seguros, Calle del Arsenal No 8B-195 piso 1","GPS CIUDAD","ABRIL",25,3,"Adsie",null,4]
[null,"EMERGENCIAS","Curso de emergencias.  Módulo 2. Evacuación y plan de emergencia.","Brigadistas","PRESENCIAL ","CARTAGENA","8:00 a.m. - 12:00 m","2019-05-16","Liberty Seguros, Calle del Arsenal No 8B-195 piso 1","GPS CIUDAD","MAYO",25,3,"Adsie",null,4]
[null,"EMERGENCIAS","Curso de emergencias.  Módulo 3. Contraincendio y recursos para emergencias.  ","Brigadistas","PRESENCIAL ","CARTAGENA","8:00 a.m. - 12:00 m","2019-06-13","Liberty Seguros, Calle del Arsenal No 8B-195 piso 1","GPS CIUDAD","JUNIO",25,3,"Adsie",null,4]
[null,"EMERGENCIAS","Curso de emergencias.  Módulo 1. Primeros auxilios ","Brigadistas","PRESENCIAL ","BARRANQUILLA","8:00 a.m. - 12:00 m","2019-08-15","ICONTEC Cra 57 No. 70-89 Barranquilla","GPS CIUDAD","AGOSTO",25,3,null,null,4]
[null,"EMERGENCIAS","Curso de emergencias.  Módulo 2. Evacuación y plan de emergencia.","Brigadistas","PRESENCIAL ","BARRANQUILLA","8:00 a.m. - 12:00 m","2019-09-05","ICONTEC Cra 57 No. 70-89 Barranquilla","GPS CIUDAD","SEPTIEMBRE",25,3,null,null,4]
[null,"EMERGENCIAS","Curso de emergencias.  Módulo 3. Contraincendio y recursos para emergencias.  ","Brigadistas","PRESENCIAL ","BARRANQUILLA","8:00 a.m. - 12:00 m","2019-09-19","ICONTEC Cra 57 No. 70-89 Barranquilla","GPS CIUDAD","SEPTIEMBRE",25,3,null,null,4]
[null,"EMERGENCIAS","Curso de emergencias.  Módulo 1. Primeros auxilios ","Brigadistas","PRESENCIAL ","MEDELLÍN ","8:00 a.m. - 12:00 m","2019-04-11","Carrera 43A No 19-17, auditorio piso 4 torre norte Block Empresarial","GPS CIUDAD","ABRIL",40,null,null,null,4]
[null,"EMERGENCIAS","Curso de emergencias.  Módulo 2. Evacuación y plan de emergencia.","Brigadistas","PRESENCIAL ","MEDELLÍN ","8:00 a.m. - 12:00 m","2019-05-16","Carrera 43A No 19-17, auditorio piso 4 torre norte Block Empresarial","GPS CIUDAD","MAYO",40,null,null,null,4]
[null,"EMERGENCIAS","Curso de emergencias.  Módulo 3. Contraincendio y recursos para emergencias.  ","Brigadistas","PRESENCIAL ","MEDELLÍN ","8:00 a.m. - 12:00 m","2019-06-13","Carrera 43A No 19-17, auditorio piso 4 torre norte Block Empresarial","GPS CIUDAD","JUNIO",40,null,null,null,4]
[null,"EMERGENCIAS","Entrenamiento práctico de emergencias  ","Brigadista con formación teórica ","PRESENCIAL ","MEDELLÍN ","8:00 am - 5:00 pm","2019-04-05","Calle 36 D sur N° 23 -07 Envigado.","GPS CIUDAD","ABRIL",50,4,"MG MASTER GROUP SAS",null,8]
[null,"EMERGENCIAS","Entrenamiento práctico de emergencias  ","Brigadista con formación teórica ","PRESENCIAL ","MEDELLÍN ","8:00 am - 5:00 pm","2019-10-18","Calle 36 D sur N° 23 -07 Envigado.","GPS CIUDAD","OCTUBRE",50,4,"MG MASTER GROUP SAS",null,8]
[null,"EMERGENCIAS","Entrenamiento práctico de emergencias  ","Brigadista con formación teórica ","PRESENCIAL ","CARTAGENA","8:00 am - 5:00 pm","2019-10-25","Previo a la actividad se estará confirmando lugar del evento ","GPS CIUDAD","OCTUBRE",40,2,"Adsie",null,8]
[null,"EMERGENCIAS","Entrenamiento práctico de emergencias  ","Brigadista con formación teórica ","PRESENCIAL ","CALI","8:00 am - 5:00 pm","2019-07-26","CRA. 2 NRO. 4 - 29   YUMBO","GPS CIUDAD","JULIO",30,2,"BOMBEROS YUMBO",null,8]
[null,"EMERGENCIAS","Entrenamiento práctico de emergencias  ","Brigadista con formación teórica ","PRESENCIAL ","CALI","8:00 am - 5:00 pm","2019-10-25","CRA. 2 NRO. 4 - 29   YUMBO","GPS CIUDAD","OCTUBRE",30,2,"BOMBEROS YUMBO",null,8]
[null,"EMERGENCIAS","Entrenamiento práctico de emergencias  ","Brigadista con formación teórica ","PRESENCIAL ","BUCARAMANGA","8:00 am - 5:00 pm","2019-10-25","CAJASAN Campo Alegre Vía Bucaramanga - Piedecuesta","GPS CIUDAD","OCTUBRE",25,2,null,null,8]
[null,"EMERGENCIAS","Entrenamiento práctico de emergencias","Brigadista con formación teórica ","PRESENCIAL ","BOGOTÁ","8:00 am - 5:00 pm","2019-04-26","Pista San José ","ESPECIALISTA P Y P ","ABRIL",55,2,null,null,8]
[null,"EMERGENCIAS","Entrenamiento práctico de emergencias","Brigadista con formación teórica ","PRESENCIAL ","BOGOTÁ","8:00 am - 5:00 pm","2019-07-26","Pista San José ","ESPECIALISTA P Y P ","JULIO",55,2,null,null,8]
[null,"EMERGENCIAS","Entrenamiento práctico de emergencias  ","Brigadista con formación teórica ","PRESENCIAL ","BARRANQUILLA","8:00 am - 5:00 pm","2019-10-03","Previo a la actividad se estará confirmando lugar del evento ","GPS CIUDAD","OCTUBRE",25,3,null,null,8]
[null,"EMERGENCIAS","Entrenamiento práctico de emergencias  ","Brigadista con formación teórica ","PRESENCIAL ","BARRANCABERMEJA","8:00am  - 5:00pm","2019-10-25","Pendiente por definir","GPS CIUDAD","OCTUBRE",25,2,null,null,40]
[null,"COPASST","Gestión Efectiva del Copasst. Módulo 1. Funciones y responsabilidades frente a dec. 1072 ,Reuniones efectivas, plan de trabajo,  Inspecciones de seguridad  y  auditoria.  ","Dirigidos a los copasst y vigias de seguridad y salud en el trabajo. ","PRESENCIAL ","BOGOTÁ","8:00 a.m. - 12:00 m","2019-03-21","Calle 73 N° 10 - 83 Torre C Oficina 302. Salón 302 Fucsia","pyp ",{"$f":"UPPER(TEXT(H258,\"mmmm\"))","v":"MARZO"},40,2,"Montajes y procesos mgonzalez@montajesyprocesos.com",null,4]
[null,"COPASST","Gestión Efectiva del Copasst. Módulo 2:  Investigación accidentes de trabajo ","Dirigidos a los copasst y vigias de seguridad y salud en el trabajo. ","PRESENCIAL ","BOGOTÁ","8:00 a.m. - 12:00 m","2019-04-04","Calle 73 N° 10 - 83 Torre C Oficina 302. Salón 302 Fucsia","pyp ","ABRIL",40,2,null,null,4]
[null,"COPASST","Gestión Efectiva del Copasst. Módulo 1. Funciones y responsabilidades frente a dec. 1072 ,Reuniones efectivas, plan de trabajo,  Inspecciones de seguridad  y  auditoria.  ","Dirigidos a los copasst y vigias de seguridad y salud en el trabajo. ","PRESENCIAL ","BOGOTÁ","8:00 a.m. - 12:00 m","2019-08-29","Calle 73 N° 10 - 83 Torre C Oficina 302. Salón 302 Fucsia","pyp ","AGOSTO",40,2,null,null,4]
[null,"COPASST","Gestión Efectiva del Copasst. Módulo 2:  Investigación accidentes de trabajo ","Dirigidos a los copasst y vigias de seguridad y salud en el trabajo. ","PRESENCIAL ","BOGOTÁ","8:00 a.m. - 12:00 m","2019-09-19","Calle 73 N° 10 - 83 Torre C Oficina 302. Salón 302 Fucsia","pyp ","SEPTIEMBRE",40,2,null,null,4]
[null,"COPASST","Gestión Efectiva del Copasst. Módulo 1. Funciones y responsabilidades frente a dec. 1072 ,Reuniones efectivas, plan de trabajo,  Inspecciones de seguridad  y  auditoria.  ","Dirigidos a los copasst y vigias de seguridad y salud en el trabajo. ","PRESENCIAL ","MEDELLÍN ","8:00 a.m. - 12:00 m","2019-02-21","Carrera 43A No 19-17, auditorio piso 4 torre norte Block Empresarial","GPS CIUDAD","FEBRERO",40,4,"RIGS SAS  ",null,4]
[null,"COPASST","Gestión Efectiva del Copasst. Módulo 2:  Investigación accidentes de trabajo ","Dirigidos a los copasst y vigias de seguridad y salud en el trabajo. ","PRESENCIAL ","MEDELLÍN ","8:00 a.m. - 12:00 m","2019-11-20","Carrera 43A No 19-17, auditorio piso 4 torre norte Block Empresarial","GPS CIUDAD","NOVIEMBRE",40,4,"RIGS SAS  ",null,4]
[null,"COPASST","Gestión Efectiva del Copasst. Módulo 1. Funciones y responsabilidades frente a dec. 1072 ,Reuniones efectivas, plan de trabajo,  Inspecciones de seguridad  y  auditoria.  ","Dirigidos a los copasst y vigias de seguridad y salud en el trabajo. ","PRESENCIAL ","CARTAGENA","8:00 a.m. - 12:00 m","2019-03-21","Liberty Seguros, Calle del Arsenal No 8B-195 piso 1","GPS CIUDAD","MARZO",25,3,"Gestión Interriesgos",null,4]
[null,"COPASST","Gestión Efectiva del Copasst. Módulo 2:  Investigación accidentes de trabajo ","Dirigidos a los copasst y vigias de seguridad y salud en el trabajo. ","PRESENCIAL ","CARTAGENA","8:00 a.m. - 12:00 m","2019-04-04","Liberty Seguros, Calle del Arsenal No 8B-195 piso 1","GPS CIUDAD","ABRIL",25,3,"Gestión Interriesgos",null,4]
[null,"COPASST","Gestión Efectiva del Copasst. Módulo 1. Funciones y responsabilidades frente a dec. 1072 ,Reuniones efectivas, plan de trabajo,  Inspecciones de seguridad  y  auditoria.  ","Dirigidos a los copasst y vigias de seguridad y salud en el trabajo. ","PRESENCIAL ","CALI","8:00 a.m. - 12:00 m","2019-03-07","Av. 5 Norte # 38N-81","GPS CIUDAD","MARZO",30,2,"SAFE SAS",null,4]
[null,"COPASST","Gestión Efectiva del Copasst. Módulo 2:  Investigación accidentes de trabajo ","Dirigidos a los copasst y vigias de seguridad y salud en el trabajo. ","PRESENCIAL ","CALI","8:00 a.m. - 12:00 m","2019-04-04","Av. 5 Norte # 38N-81","GPS CIUDAD","ABRIL",30,2,"SAFE SAS",null,4]
[null,"COPASST","Gestión Efectiva del Copasst. Módulo 1. Funciones y responsabilidades frente a dec. 1072 ,Reuniones efectivas, plan de trabajo,  Inspecciones de seguridad  y  auditoria.  ","Dirigidos a los copasst y vigias de seguridad y salud en el trabajo. ","PRESENCIAL ","BUCARAMANGA","8:00 a.m. - 12:00 m","2019-03-21","CAJASAN Cra 27 No 61-78","GPS CIUDAD","MARZO",25,2,null,null,4]
[null,"COPASST","Gestión Efectiva del Copasst. Módulo 2:  Investigación accidentes de trabajo ","Dirigidos a los copasst y vigias de seguridad y salud en el trabajo. ","PRESENCIAL ","BUCARAMANGA","8:00 a.m. - 12:00 m","2019-04-04","Hotel La Triada Cra. 20 #34--22","GPS CIUDAD","ABRIL",25,2,null,null,4]
[null,"COPASST","Gestión Efectiva del Copasst. Módulo 1. Funciones y responsabilidades frente a dec. 1072 ,Reuniones efectivas, plan de trabajo,  Inspecciones de seguridad  y  auditoria.  ","Dirigidos a los copasst y vigias de seguridad y salud en el trabajo. ","PRESENCIAL ","BARRANQUILLA","8:00 a.m. - 12:00 m","2019-05-23","ICONTEC Cra 57 No. 70-89 Barranquilla","GPS CIUDAD","MAYO",25,3,null,null,4]
[null,"COPASST","Gestión Efectiva del Copasst. Módulo 2:  Investigación accidentes de trabajo ","Dirigidos a los copasst y vigias de seguridad y salud en el trabajo. ","PRESENCIAL ","BARRANQUILLA","8:00 a.m. - 12:00 m","2019-06-06","ICONTEC Cra 57 No. 70-89 Barranquilla","GPS CIUDAD","JUNIO",25,3,null,null,4]
[null,"COMITÉ DE CONVIVENCIA","COMITÉ DE CONVIVENCIA LABORAL (Aula viviendo en armonía).","Personal responsable del sistema de gestión, Talento humano y comité de convivencia. ","VIRTUAL ","NACIONAL","Abierto",{"$f":"+IF(O272>=TODAY(),O272,TODAY()+2)","v":"2019-10-31"},"Liberty University","PYP ","OCTUBRE","Abierto",200,null,"2019-02-01",2]
[null,"ATENCION DEL ACCIDENTE LABORAL ","Acceso al servicio Asistencial y Reconocimiento de las prestaciones económicas de las contingencias de los accidentes laborales AL y enfermedad laboral EL.\n","Los participantes deben estar afiliados a la ARL LIBERTY  y  tener a cargo el Sistema de Gestión de Seguridad y Salud en el Trabajo o pertenecer al área de Recursos Humanos o área médica de la empresa.","VIRTUAL ","NACIONAL","9:00 - 11:00 a.m.","2019-03-01","Liberty University","ADMINISTRADORA DE CASOS","MARZO","Abierto",200,null,"2019-02-01",2]
[null,"ATENCION DE LA ENFERMEDAD LABORAL","Proceso de definición de enfermedad laboral y calificación, acciones para prevenir los daños en caso de IPP e invalidez, para lograr la rehabilitación integral, procesos de readaptación y reubicación laboral","Los participantes deben estar afiliados a la ARL LIBERTY  y  tener a cargo el Sistema de Gestión de Seguridad y Salud en el Trabajo o pertenecer al área de Recursos Humanos o área médica de la empresa.","VIRTUAL ","NACIONAL","9:00 a 11:00 a.m. ","2019-03-01","Liberty University","ANA MARIA SANCHEZ","MARZO","Abierto",200,null,"2019-02-01",2]
[null,"GESTION DEL RIESGO BAJO LA 31000 ","Propósito de la norma ISO 31000. ","Los participantes deben estar afiliados a la ARL LIBERTY.","VIRTUAL ","NACIONAL","10:00 a.m. a 12:00 m","2019-05-27","Liberty University",null,"MAYO",null,200,null,null,2]
[null,"LIBERTY MUTUAL ","Prevention through Design (PtD)","Requisito manejo del Inglés","VIRTUAL ","NACIONAL","2:00 - 3:00 p.m.","2019-05-08","LIBERTY MUTUAL",null,"MAYO",null,null,null,null,2]
[null,"LIBERTY MUTUAL ","Opioids in the Workplace","Requisito manejo del Inglés","VIRTUAL ","NACIONAL","2:00 - 3:00 p.m.","2019-05-14","LIBERTY MUTUAL",null,{"$f":"UPPER(TEXT(H277,\"mmmm\"))","v":"MAYO"},null,null,null,null,2]
[null,"LIBERTY MUTUAL ","Journey Management","Requisito manejo del Inglés","VIRTUAL ","NACIONAL","2:00 - 3:00 p.m.","2019-05-16","LIBERTY MUTUAL",null,{"$f":"UPPER(TEXT(H278,\"mmmm\"))","v":"MAYO"},null,null,null,null,2]
[null,"LIBERTY MUTUAL ","Management Systems for Occupational Health & Safety","Requisito manejo del Inglés","VIRTUAL ","NACIONAL","2:00 - 3:00 p.m.","2019-05-23","LIBERTY MUTUAL",null,{"$f":"UPPER(TEXT(H279,\"mmmm\"))","v":"MAYO"},null,null,null,null,2]
[null,"LIBERTY MUTUAL ","Slip, Trips and Falls Prevention","Requisito manejo del Inglés","VIRTUAL ","NACIONAL","2:00 - 3:00 p.m.","2019-06-04","LIBERTY MUTUAL",null,{"$f":"UPPER(TEXT(H280,\"mmmm\"))","v":"JUNIO"},null,null,null,null,2]
[null,"LIBERTY MUTUAL ","Business Continuity - Planning for the Unexpected","Requisito manejo del Inglés","VIRTUAL ","NACIONAL","2:00 - 3:00 p.m.","2019-06-05","LIBERTY MUTUAL",null,"JUNIO",null,null,null,null,2]
[null,"LIBERTY MUTUAL ","Safety Climate - The Pulse of Safety in Organizations","Requisito manejo del Inglés","VIRTUAL ","NACIONAL","2:00 - 3:00 p.m.","2019-05-11","LIBERTY MUTUAL",null,{"$f":"UPPER(TEXT(H282,\"mmmm\"))","v":"MAYO"},null,null,null,null,2]
[null,"LIBERTY MUTUAL ","Risk Control Services: A Virtual Overview","Requisito manejo del Inglés","VIRTUAL ","NACIONAL","2:00 - 3:00 p.m.","2019-09-05","LIBERTY MUTUAL",null,{"$f":"UPPER(TEXT(H283,\"mmmm\"))","v":"SEPTIEMBRE"},null,null,null,null,2]
[null,"LIBERTY MUTUAL ","General Liability Incident Response","Requisito manejo del Inglés","VIRTUAL ","NACIONAL","2:00 - 3:00 p.m.","2019-09-19","LIBERTY MUTUAL",null,{"$f":"UPPER(TEXT(H284,\"mmmm\"))","v":"SEPTIEMBRE"},null,null,null,null,2]
[null,"LIBERTY MUTUAL ","Getting Results: Coaching & Feedback for Supervisors","Requisito manejo del Inglés","VIRTUAL ","NACIONAL","2:00 - 3:00 p.m.","2019-10-10","LIBERTY MUTUAL",null,{"$f":"UPPER(TEXT(H285,\"mmmm\"))","v":"OCTUBRE"},null,null,null,null,2]
[null,"RECLASIFICACIÓN DE RIESGOS ","Explica el concepto y proceso de reclasificación; cuándo es procendente realizarlo y cuándo no.  ","Dirigido para encargados del Sistema de Gestión de Seguridad y Salud en el Trabajo y personal del área de Talento Humano. ","VIRTUAL ","NACIONAL","Abierto",{"$f":"+IF(O286>=TODAY(),O286,TODAY()+2)","v":"2019-10-31"},"Liberty University",null,"OCTUBRE",null,null,null,null,2]
[null,"LIBERTY MUTUAL ","Active Shooter/Workplace Violence - Managing the Crisis","Requisito manejo del Inglés","VIRTUAL ","NACIONAL","2:00 - 3:00 p.m.","2019-10-23","LIBERTY MUTUAL",null,{"$f":"UPPER(TEXT(H287,\"mmmm\"))","v":"OCTUBRE"},null,null,null,null,2]
[]
[]
[]
[]
[]
[]
[]
[]
[]
[]
[]
[]
[]
[]
[]
[]
[]
[]
[]
[]
[]
[]
[]
[]
[]
[]
[]
[]
[]
[]
[]
[]
[]
[]
[]
[]
[]
[]
[]
[]
[]
[]
[]
[]
[]
[]
[]
[]
[]
[]
[]
[]
[]
[]
[]
[]
[]
[]
[]
[]
[]
[]
[]
[]
[]
[]
[]
[]
[]
[]
[]
[]
[null,null,null,null,null,null,null,null,null,null,{"$f":"IF(H360=\"\",\"\",PROPER(+TEXT(H360,\"mmmm\")))","v":""}]
[null,null,null,null,null,null,null,null,null,null,""]
[null,null,null,null,null,null,null,null,null,null,""]
[null,null,null,null,null,null,null,null,null,null,""]
[null,null,null,null,null,null,null,null,null,null,""]
[null,null,null,null,null,null,null,null,null,null,""]
[null,null,null,null,null,null,null,null,null,null,""]
[null,null,null,null,null,null,null,null,null,null,""]
[null,null,null,null,null,null,null,null,null,null,""]
[null,null,null,null,null,null,null,null,null,null,""]
[null,null,null,null,null,null,null,null,null,null,""]
[null,null,null,null,null,null,null,null,null,null,""]
[null,null,null,null,null,null,null,null,null,null,""]
[null,null,null,null,null,null,null,null,null,null,""]
[null,null,null,null,null,null,null,null,null,null,""]
[null,null,null,null,null,null,null,null,null,null,""]
[null,null,null,null,null,null,null,null,null,null,""]
[null,null,null,null,null,null,null,null,null,null,""]
[null,null,null,null,null,null,null,null,null,null,""]
[null,null,null,null,null,null,null,null,null,null,""]
[null,null,null,null,null,null,null,null,null,null,""]
[null,null,null,null,null,null,null,null,null,null,""]
[null,null,null,null,null,null,null,null,null,null,""]
[null,null,null,null,null,null,null,null,null,null,""]
[null,null,null,null,null,null,null,null,null,null,""]
[null,null,null,null,null,null,null,null,null,null,""]
[null,null,null,null,null,null,null,null,null,null,""]
[null,null,null,null,null,null,null,null,null,null,""]
[null,null,null,null,null,null,null,null,null,null,""]
[null,null,null,null,null,null,null,null,null,null,""]
[null,null,null,null,null,null,null,null,null,null,""]
[null,null,null,null,null,null,null,null,null,null,""]
[null,null,null,null,null,null,null,null,null,null,""]
[null,null,null,null,null,null,null,null,null,null,""]
[null,null,null,null,null,null,null,null,null,null,""]
[null,null,null,null,null,null,null,null,null,null,""]
[null,null,null,null,null,null,null,null,null,null,""]
[null,null,null,null,null,null,null,null,null,null,""]
[null,null,null,null,null,null,null,null,null,null,""]
[null,null,null,null,null,null,null,null,null,null,""]
[null,null,null,null,null,null,null,null,null,null,""]
[null,null,null,null,null,null,null,null,null,null,""]
[null,null,null,null,null,null,null,null,null,null,""]
[null,null,null,null,null,null,null,null,null,null,""]
[null,null,null,null,null,null,null,null,null,null,""]
[null,null,null,null,null,null,null,null,null,null,""]
[null,null,null,null,null,null,null,null,null,null,{"$f":"IF(H406=\"\",\"\",PROPER(+TEXT(H406,\"mmmm\")))","v":""}]
[null,null,null,null,null,null,null,null,null,null,""]
[null,null,null,null,null,null,null,null,null,null,""]
[null,null,null,null,null,null,null,null,null,null,""]
[null,null,null,null,null,null,null,null,null,null,""]
[null,null,null,null,null,null,null,null,null,null,""]
[null,null,null,null,null,null,null,null,null,null,""]
[null,null,null,null,null,null,null,null,null,null,""]
[null,null,null,null,null,null,null,null,null,null,""]
[null,null,null,null,null,null,null,null,null,null,""]
[null,null,null,null,null,null,null,null,null,null,""]
[null,null,null,null,null,null,null,null,null,null,""]
[null,null,null,null,null,null,null,null,null,null,""]
[null,null,null,null,null,null,null,null,null,null,""]
[null,null,null,null,null,null,null,null,null,null,""]
[null,null,null,null,null,null,null,null,null,null,""]
[null,null,null,null,null,null,null,null,null,null,""]
[null,null,null,null,null,null,null,null,null,null,""]
[null,null,null,null,null,null,null,null,null,null,""]
[null,null,null,null,null,null,null,null,null,null,""]
[null,null,null,null,null,null,null,null,null,null,""]
[null,null,null,null,null,null,null,null,null,null,""]
[null,null,null,null,null,null,null,null,null,null,""]
[null,null,null,null,null,null,null,null,null,null,""]
[null,null,null,null,null,null,null,null,null,null,""]
[null,null,null,null,null,null,null,"ver"]

{"sheet":"Cursos Presenciales","index":5,"n_rows":3,"n_cols":15,"rows_kept":3,"cut":false,"hidden":true,"merged":[]}
["CIUDAD","MODALIDAD","TEMA","NIT \nsin número de verificación","EMPRESA","CEDULA","NOMBRES COMPLETOS DEL PARTICIPANTE","CORREO ELECTRONICO","CORREO DEL RESPONSABLE DEL SISTEMA DE GESTION DE SEGURIDAD Y SALUD EN EL TRABAJO  DE LA EMPRESA","NOMBRE DEL GESTOR O COORDINADOR DE PREVENCION","HORARIO","FECHA","LUGAR",{"$f":"IFERROR(+VLOOKUP(C2,'PRESENCIAL NACIONAL - VIRTUALES'!C:M,10,0),0)","v":0},{"$f":"+COUNTA(F2:F150)","v":0}]
[null,null,null,null,null,null,null,null,null,null,"8:00 a.m. - 12:00 m","2019-05-09","ICONTEC Cra 57 No. 70-89 Barranquilla"]
[null,null,null,null,null,null,null,null,null,null,"8:00 a.m. - 12:00 m","2019-05-09","ICONTEC Cra 57 No. 70-89 Barranquilla"]

{"sheet":"Cursos Virtuales","index":6,"n_rows":2,"n_cols":16,"rows_kept":2,"cut":false,"hidden":true,"merged":[]}
["CÉDULA","APELLIDOS","NOMBRES","FECHA DE NACIMIENTO\n(SOLO CURSO 50 H0RAS  SG-SST)","CORREO","CIUDAD","TELEFONO 1","TELEFONO 2","EMPRESA","NIT \nsin número de verificación","NOMBRE DEL GESTOR  O COORDINADOR DE PREVENCIÓN","CORREO DEL RESPONSABLE DEL SISTEMA DE GESTION DE SEGURIDAD Y SALUD EN EL TRABAJO  DE LA EMPRESA","CURSO","FECHA DE APERTURA DEL CURSO",{"$f":"IFERROR(+VLOOKUP(M2,'PRESENCIAL NACIONAL - VIRTUALES'!C:M,11,0),0)","v":0},{"$f":"+COUNTA(A2:A150)","v":0}]
[null,null,null,null,null,null,null,null,null,null,null,null,"Explica el concepto y proceso de reclasificación; cuándo es procendente realizarlo y cuándo no.  ","2019-07-11"]

{"sheet":"Video Reclasificación","index":7,"n_rows":18,"n_cols":2,"rows_kept":18,"cut":false,"hidden":true,"merged":[[17,1,17,7]]}
[]
[]
[]
[]
[]
[]
[]
[]
[]
[]
[]
[]
[]
[]
[]
[]
[]
[null,"De click sobre la imagen para ver el video "]

{"sheet":"Virtual Cruz Roja","index":8,"n_rows":12,"n_cols":15,"rows_kept":12,"cut":false,"hidden":true,"merged":[[10,8,11,8],[10,9,11,9],[10,10,11,10],[10,11,11,11],[10,12,11,12],[6,1,6,7],[7,1,7,7],[10,7,11,7],[10,0,11,0],[10,1,10,2],[10,3,10,4],[10,5,11,5],[10,6,11,6]]}
[null,null,null,null,null,null,null,null,null,null,null,null,null,{"$f":"IFERROR(+VLOOKUP(B7,'PRESENCIAL NACIONAL - VIRTUALES'!C:M,12,0),0)","v":0},{"$f":"+COUNTA(A13:A1500)","v":0}]
[]
[]
[]
["FORMATO DE INSCRIPCIÓN PROCESOS VIRTUALES"]
[]
["CURSO:"]
["FECHA:"]
[]
["* CAMPOS OBLIGATORIOS Deben ser diligenciado en MAYUSCULAS."]
["* IDENTIFICACIÓN CÉDULA","*NOMBRES",null,"*APELLIDOS",null,"*EMAIL","EMAIL2 ALTERNO","*CIUDAD /  MUNICIPIO","*DEPARTAMENTO","*CELULAR","*EMPRESA","NIT \nsin numero de verificación","CARGO"]
[null,"Primer Nombre","Segundo Nombre","Primer Apellildo","Segundo Apellido"]

{"sheet":"Virtual en línea (Go to webinar","index":9,"n_rows":1,"n_cols":13,"rows_kept":1,"cut":false,"hidden":true,"merged":[]}
["CEDULA","NOMBRE","APELLIDO","CORREO","EMPRESA","NIT sin número de verificación ","TEMA","NOMBRE DEL GESTOR O COORDINADOR DE PREVENCION","HORA","FECHA","LUGAR",{"$f":"IFERROR(+VLOOKUP(G2,'PRESENCIAL NACIONAL - VIRTUALES'!C:M,12,0),0)","v":0},{"$f":"+COUNTA(A2:A1500)","v":0}]

{"sheet":"SENA ALTURA","index":10,"n_rows":17,"n_cols":2,"rows_kept":17,"cut":false,"hidden":true,"merged":[[10,0,16,0],[10,1,10,13],[11,1,11,13],[12,1,12,13],[13,1,13,13],[14,1,14,13],[15,1,15,13],[16,1,16,13],[0,0,0,13],[1,0,1,13],[2,0,2,13],[3,1,3,13],[4,0,9,0],[4,1,4,13],[5,1,5,13],[6,1,6,13],[7,1,7,13],[8,1,8,13],[9,1,9,13]]}
["DIRECTRICES Y MECANISMO DE INSCRIPCIÓN CURSOS ALTURAS CONVENIO SENA"]
["RADICACIÓN DE DOCUMENTOS"]
["Su asesor de prevención le estará remitiendo un correo con la información de inscripciones de los cursos ofertados por parte del SENA en el nivel de formación de Trabajo seguro en alturas (avanzado y reentrenamiento). Allí se brindarán las indicaciones de la fecha límite para radiación de documentos, la dirección y las fechas en que se realizará el curso.                                                                                                                                                                                                                                        Información importante:  Si no es posible para ustedes la fecha que ofrece el SENA, por favor absténgase de enviar la documentación en ese mes, porque una vez inscrito si no hay asistencia, el SENA generará la sanción.   El curso es directo del SENA, Liberty les apoya en el trámite de radicación, por ende, es requerido cumplir con los requisitos aquí descritos y remitir los documentos hasta la fecha límite indicada.  "]
["NIVEL DE FORMACIÓN","REQUISITOS DE INGRESO"]
["Avanzado Trabajo Seguro en Alturas (40 horas)","• Carta de solicitud indicando el nivel de capacitación, debe ir dirigida al Coordinador Académico  Luis Orlando Cortes (Si el trámite es por empresa se debe indicar el NIT)\nSe debe especificar el correo electrónico (para él envió de las novedades y programación disponible).\n"]
[null,"• Certificación médica de aptitud para realizar trabajo en alturas, con vigencia no mayor a un año, realizado por médico especialista en Salud Ocupacional que indique que la persona (trabajador) puede realizar la actividad en alturas."]
[null,"• Afiliación vigente a Seguridad Social (Pagos vigentes EPS-ARL)"]
[null,"• Fotocopia de la CC (legible)"]
[null,"• Competencias de lecto-escritura (Corresponde a la capacidad de leer y escribir - no se debe presentar ningún documento)"]
[null,"• Registro plataforma Sofía Plus www.senasofiaplus.edu.co (adjuntar pantallazo del mismo por cada aspirante)"]
["Reentrenamiento Avanzado trabajo seguro en alturas ( 20Horas)","• Carta de solicitud indicando el nivel de capacitación, debe ir dirigida al Coordinador Académico  Luis Orlando Cortes (Si es trámite es por empresa se debe indicar el NIT)\nSe debe especificar el correo electrónico (para él envió de las novedades y programación disponible)"]
[null,"• Certificación médica de aptitud para realizar trabajo en alturas, con vigencia no mayor a un  año, realizado por médico especialista en Salud Ocupacional que indique que la persona (trabajador) puede realizar la actividad en alturas."]
[null,"• Afiliación vigente a Seguridad Social (Pagos vigentes EPS-ARL)"]
[null,"• Fotocopia de la CC (legible)"]
[null,"• Competencias de lecto-escritura (Corresponde a la capacidad de leer y escribir - no se debe presentar ningún documento)"]
[null,"• Certificado de formación en el nivel avanzado para trabajo en alturas."]
[null,"• Registro plataforma Sofía Plus www.senasofiaplus.edu.co (adjuntar pantallazo del mismo por cada aspirante)"]